program: Gaussian 09
title: 000252582
version: EM64L-G09RevD.01
frameworkgroup: C1[X(C11H20O2)]
method: RPBEPBE
basis: SDD
operation: Freq
keyword: #pfreq=noraman
keyword: PBEPBE/SDD
title: #p freq=noraman PBEPBE/SDD
converged: YES YES NO NO
title: Mulliken charges:
elementType: O O C C C C C C C C C C C H H H H H H H H H H H H H H H H H H H H
charge: -0.302205 -0.273105 0.332605 -0.453126 -0.504454 0.340527 -0.444270 -0.423014 -0.437056 -0.008734 -0.731632 -0.738798 -0.727562 0.213445 0.231951 0.215008 0.246644 0.213564 0.208482 0.221574 0.220192 0.221391 0.193900 0.189723 0.235021 0.198738 0.226338 0.211434 0.230141 0.229740 0.226719 0.232338 0.204481
chargesum: 0.00000
title: Mulliken charges with hydrogens summed into heavy atoms:
elementType: O O C C C C C C C C C C C
charge: -0.302205 -0.273105 0.332605 -0.007729 -0.042802 0.340527 -0.022225 0.018752 -0.021765 0.180989 -0.071535 -0.067482 -0.064024
polarizability: 1.37726263e+02 -1.33654221e-02 1.19238007e+02 1.24686115e+00 5.07127942e-02 1.07525681e+02
1716.lowfreq: -16.0288 -9.4041 -0.0006 -0.0005 -0.0004 10.0903 27.6731 108.4745 122.7153
frequency: 26.2912 108.4068 122.6403 145.1813 169.3028 183.6404 199.9407 238.6913 259.6850 266.8028 281.2525 312.3610 329.3934 350.0183 418.8348 431.5814 468.4085 475.9571 493.1171 511.7973 558.9758 673.6601 725.9537 745.8727 779.8337 819.7984 842.3878 852.6330 865.1736 900.8643 903.2679 923.7018 926.2417 939.9273 963.1876 971.2690 990.7078 1019.3933 1040.4219 1050.9578 1066.5391 1089.8881 1132.3802 1146.5048 1161.1481 1173.6689 1182.8126 1209.5582 1217.8352 1238.0338 1245.1710 1261.3857 1280.5665 1295.0228 1304.6468 1308.4827 1322.8100 1328.2972 1358.6476 1373.9333 1386.5960 1389.7514 1434.1309 1446.1958 1449.3519 1454.1830 1459.0682 1467.6818 1467.8253 1475.7149 1477.9925 1480.0762 1489.7189 2935.7713 2983.8072 2984.8058 2988.2054 2990.7979 2994.7218 3006.8267 3013.3015 3018.7407 3052.1751 3055.9976 3072.8114 3077.2595 3085.9576 3087.7918 3090.6456 3094.4476 3095.6014 3097.9563 3102.4236
redmass: 2.2831 3.0319 2.7572 2.8600 1.9205 1.0774 1.0704 1.6609 1.8260 2.1240 1.6845 3.1326 3.2194 3.0571 2.7401 2.9232 2.5861 3.0001 3.2573 3.0029 2.0162 3.2047 3.5937 3.5995 1.9219 2.1718 2.0369 3.0544 2.8347 2.1534 2.5403 2.0815 1.4418 1.5770 1.7240 1.7811 1.2824 1.8291 1.6527 2.3021 2.1390 2.1992 2.3435 2.0193 1.9041 2.0826 1.6075 2.2653 1.5045 1.8465 1.3455 1.9162 1.2893 1.5075 1.3600 1.3856 1.5282 1.3881 1.6124 1.2292 1.2555 1.2163 1.0888 1.0800 1.0891 1.0567 1.0475 1.0534 1.0814 1.0668 1.0499 1.0923 1.0531 1.0819 1.0422 1.0444 1.0357 1.0437 1.0603 1.0611 1.0650 1.0642 1.1025 1.0986 1.1032 1.0988 1.0994 1.0994 1.1017 1.1003 1.1002 1.0997 1.1028
irintensity: 0.0252 0.5830 2.2786 1.0584 1.1129 0.2245 0.0451 0.5008 1.3858 0.4196 0.6799 2.7649 2.5769 0.4098 3.6319 0.4856 1.0150 3.5859 5.1725 6.1641 1.3262 1.5540 1.4113 10.0113 7.4229 9.1635 8.4422 15.4708 33.8303 7.9520 3.7287 15.5580 1.0142 34.1285 11.3626 20.6858 2.2534 33.0968 9.3069 19.1896 74.7766 22.2672 7.4815 71.8676 9.7328 37.9138 23.6623 28.7458 11.4950 13.3142 5.6180 30.2855 5.8047 10.5897 2.3086 2.1929 42.8817 0.0425 26.7092 27.2682 21.5037 17.9671 5.6427 11.3615 7.0730 2.8314 11.2113 4.9313 9.7426 4.2449 7.6889 3.6846 15.4479 40.9198 23.9495 4.9544 33.1631 46.1688 40.0118 49.7323 23.2107 12.2157 19.3141 24.7020 37.3306 21.2497 26.0742 33.8147 48.4413 14.2033 41.7514 32.0527 35.1696
temp: 298.150 k
press: 1.00000 atm
elementType: 8 8 6 6 6 6 6 6 6 6 6 6 6 1 1 1 1 1 1 1 1 1 1 1 1 1 1 1 1 1 1 1 1
symmnumber: 1
zpe: 763774.9 jmol-1
zpe.correction: 0.290907 hartree
zpe.thermalcorrener: 0.304700 hartree
zpe.thermalcorrenthalpy: 0.305644 hartree
zpe.thermalcorrgfe: 0.251418 hartree
zpe.sumelectzpe: -580.554519 hartree
zpe.sumelectthermal: -580.540726 hartree
zpe.sumelectthermalent: -580.539782 hartree
zpe.sumelectthermalfe: -580.594008 hartree
dipole: 1.2784 0.1604 1.7154
dipole: 2.1453
quadrupole: -75.4103 -81.5296 -80.9925
quadrupole: 2.0506 0.5061 0.1946
quadrupole: 3.9005 -2.2188 -1.6817 2.0506 0.5061 0.1946
hfenergy: -580.8454257 hartree
pointgroup: C01 [X(C11H20O2)]
dipole: -0.5122366 -0.0764955 -0.6664632 debye
polarizability: 136.483519|4.6920619|120.5138691|0.7314351|0.0926566|107.4925636 unknown
InChI: InChI=1S/C11H20O2/c1-9-8-10(2,3)13-11(12-9)6-4-5-7-11/h9H,4-8H2,1-3H3
charge 0 multiplicity 1
33 atoms
O  -0.011624 -1.203066 0.619805
O  0.02624 1.219122 0.379273
C  0.792466 -0.036867 0.236737
C  1.467916 -0.133076 -1.179911
C  1.954641 0.071227 1.241495
C  -1.400104 -1.322164 0.059699
C  2.98329 0.166339 -0.949729
C  3.057534 0.815742 0.459743
C  -2.121802 0.045552 0.197593
C  -1.268362 1.211147 -0.339659
C  -2.04962 -2.379587 0.96896
C  -1.375322 -1.824215 -1.405353
C  -1.894666 2.58535 -0.094929
H  1.020268 0.607901 -1.866378
H  1.319325 -1.13647 -1.610735
H  2.278309 -0.954232 1.498521
H  1.621764 0.579258 2.160246
H  3.411192 0.809991 -1.73857
H  3.556506 -0.780296 -0.948891
H  4.05511 0.717464 0.922791
H  2.810277 1.891833 0.401465
H  -2.325087 0.236294 1.268503
H  -3.09149 0.007035 -0.336419
H  -1.083381 1.076144 -1.429148
H  -1.98947 -2.059265 2.022998
H  -3.111611 -2.52694 0.699508
H  -1.523231 -3.345423 0.871838
H  -2.398877 -2.097928 -1.722668
H  -0.9945 -1.067155 -2.111366
H  -0.738719 -2.722871 -1.482378
H  -2.047482 2.746788 0.986801
H  -1.232551 3.384083 -0.471436
H  -2.871441 2.664887 -0.606104
