program: Gaussian 09
title: 000252581
version: EM64L-G09RevD.01
frameworkgroup: C1[X(C11H15ClN2O3)]
method: RPBEPBE
basis: SDD
operation: Freq
keyword: #p
keyword: freq=noraman
keyword: PBEPBE/SDD
title: #p freq=noraman PBEPBE/SDD
converged: YES YES NO NO
title: Mulliken charges:
elementType: Cl O O O N N C C C C C C C C C C C H H H H H H H H H H H H H H H
charge: -0.079630 -0.447100 -0.506315 -0.350937 -0.163839 -0.501308 -0.438008 -0.438218 0.298813 -0.270092 -0.261139 0.473362 -0.444765 -0.348910 -0.036697 -0.190641 -0.266309 0.267789 0.194538 0.264126 0.232247 0.203459 0.174062 0.214882 0.212448 0.399341 0.259413 0.311607 0.230691 0.374588 0.376993 0.255547
chargesum: 0.00000
title: Mulliken charges with hydrogens summed into heavy atoms:
elementType: Cl O O O N N C C C C C C C C C C C
charge: -0.079630 -0.072512 -0.129322 -0.350937 -0.163839 -0.101966 0.024319 0.058155 0.298813 0.107429 0.166191 0.473362 -0.185352 -0.037303 -0.036697 0.040051 -0.010762
polarizability: 2.34459722e+02 -2.33432075e+00 1.65544427e+02 1.66175106e+00 4.06807379e+00 8.25971173e+01
1716.lowfreq: -0.0016 -0.0015 0.0019 0.5495 6.1443 9.9659 26.7174 50.6541 51.6733
frequency: 26.4607 50.6414 51.6327 68.0253 74.5929 114.6235 148.5756 151.3189 169.8663 183.9106 224.3057 241.6355 247.9901 275.6178 293.4888 325.0272 361.0301 380.9996 417.8379 435.0145 440.1919 480.6093 507.5331 566.2667 606.9050 618.3614 674.9306 683.8642 692.1682 713.6214 786.8425 805.7138 818.8969 842.1131 856.2940 862.2203 906.7513 908.2416 954.1925 957.5228 978.0039 988.7484 1011.5468 1039.3869 1044.3243 1066.8966 1071.4897 1094.7019 1106.9466 1158.3015 1175.6580 1197.1062 1211.3079 1226.2158 1258.6027 1268.0614 1293.2130 1313.9265 1342.9681 1351.6072 1366.3124 1369.0619 1389.9007 1403.5236 1421.2567 1442.2725 1451.0440 1464.9393 1468.5751 1474.5435 1476.9058 1550.7694 1578.7899 1615.0508 1644.8290 2913.0214 2971.6394 2993.9826 3000.7500 3025.0212 3038.2025 3058.7259 3065.7799 3144.5235 3152.8359 3179.2162 3199.2877 3223.4339 3248.5993 3614.9889
redmass: 7.6264 4.7013 4.4874 6.0642 4.1973 7.0839 3.1902 4.3061 6.5443 5.2876 4.0655 4.2366 4.6945 2.1209 1.7476 4.5012 4.9145 3.7374 7.1086 3.3044 3.1282 1.9122 2.7919 5.1833 3.6874 4.7616 6.2444 2.0163 1.5717 2.7898 1.3303 3.5025 2.5220 2.1702 3.8921 1.8471 1.3663 1.4293 2.2354 2.6469 5.6616 1.3253 2.7882 3.3526 1.9823 2.4825 2.0333 1.5758 2.2545 1.8031 1.0859 1.4498 1.0930 1.2601 1.8232 1.5435 1.4101 1.8026 1.3344 1.2616 1.3637 2.9800 1.5316 1.8301 3.3510 1.0890 1.2184 1.0911 1.1172 1.3815 2.0225 3.7109 6.6885 7.1062 1.6083 1.0697 1.0562 1.0617 1.0634 1.0905 1.1067 1.1029 1.1034 1.0889 1.0925 1.0954 1.0951 1.0817 1.0697 1.0669
irintensity: 2.9695 4.1593 1.3677 3.0362 0.3940 0.2962 7.0756 3.3090 4.3905 0.7881 1.8225 1.0280 9.4211 78.4210 80.8124 16.5707 2.4418 1.7921 10.8743 3.3047 6.3801 8.0250 7.9975 0.2024 12.7392 3.0546 17.3370 6.8206 94.0954 61.0225 70.8895 9.0873 0.6781 15.2299 29.4033 17.9716 56.8466 48.0922 28.7290 8.5221 15.7514 4.6094 73.9970 99.7478 3.5136 4.9358 20.4435 17.8535 9.0773 8.7755 0.5769 152.2425 13.0327 12.8742 33.6328 73.0895 27.8416 81.3748 22.3438 11.1100 49.4202 14.8962 35.1171 206.7096 87.5754 28.8582 173.3219 8.6205 8.0588 1.9603 238.5276 214.4356 285.5165 183.3822 206.7657 93.3155 66.3547 18.5760 22.5008 116.0568 48.8776 17.7631 24.6387 13.7403 2.6019 3.1639 8.4983 443.0478 512.1529 20.7207
temp: 298.150 k
press: 1.00000 atm
elementType: 17 8 8 8 7 7 6 6 6 6 6 6 6 6 6 6 6 1 1 1 1 1 1 1 1 1 1 1 1 1 1 1
symmnumber: 1
zpe: 664361.9 jmol-1
zpe.correction: 0.253042 hartree
zpe.thermalcorrener: 0.270045 hartree
zpe.thermalcorrenthalpy: 0.270989 hartree
zpe.thermalcorrgfe: 0.206866 hartree
zpe.sumelectzpe: -1222.117660 hartree
zpe.sumelectthermal: -1222.100657 hartree
zpe.sumelectthermalent: -1222.099713 hartree
zpe.sumelectthermalfe: -1222.163836 hartree
dipole: -2.1018 7.4648 -0.7615
dipole: 7.7924
quadrupole: -118.2692 -98.6973 -108.4938
quadrupole: -30.0294 0.3248 -2.8714
quadrupole: -9.7824 9.7895 -0.0071 -30.0294 0.3248 -2.8714
hfenergy: -1222.370702 hartree
pointgroup: C01 [X(C11H15Cl1N2O3)]
dipole: -1.4667793 2.6406025 -0.5240133 debye
polarizability: 231.9040355|13.2283088|168.2413676|1.7153027|-2.0799089|82.4558631 unknown
InChI: InChI=1S/C11H15ClN2O3/c12-9-2-1-3-10(8-9)13-11(17)14(4-6-15)5-7-16/h1-3,8,13,15-16H,4-7H2
charge 0 multiplicity 1
32 atoms
Cl 4.808147 2.18233 0.159411
O  -3.289939 -3.041848 0.547379
O  -1.108196 2.785723 -0.66621
O  -0.995606 -1.860052 -0.333546
N  -2.34562 0.030928 -0.06335
N  -0.008365 0.279479 -0.173759
C  -3.55783 -0.751614 -0.427107
C  -2.537245 1.319715 0.631027
C  -1.093416 -0.589483 -0.191855
C  -4.016211 -1.785779 0.632987
C  -2.517096 2.561934 -0.27501
C  1.365672 -0.058989 -0.072367
C  2.280175 1.031517 -0.013437
C  1.858459 -1.391931 -0.026433
C  3.653374 0.764222 0.088094
C  3.247312 -1.612338 0.085281
C  4.171813 -0.54305 0.142442
H  -3.36146 -1.291267 -1.372016
H  -4.36617 -0.019789 -0.616161
H  -1.763474 1.446379 1.411712
H  -3.512126 1.289547 1.152402
H  -5.08164 -2.030233 0.459528
H  -3.928857 -1.330812 1.647197
H  -2.890228 3.440148 0.289331
H  -3.150864 2.399288 -1.169379
H  -0.228891 1.28096 -0.343001
H  1.916647 2.063921 -0.03547
H  1.155335 -2.223288 -0.091893
H  3.621937 -2.641053 0.121198
H  -2.349428 -2.826998 0.254897
H  -1.036922 3.429049 -1.410867
H  5.247413 -0.719715 0.222871
