program: Gaussian 09
title: 000252580
version: EM64L-G09RevD.01
frameworkgroup: C1[X(C11H14O)]
method: RPBEPBE
basis: SDD
operation: Freq
keyword: #pfreq=noraman
keyword: PBEPBE/SDD
title: #p freq=noraman PBEPBE/SDD
converged: YES YES NO NO
title: Mulliken charges:
elementType: O C C C C C C C C C C C H H H H H H H H H H H H H H
charge: -0.264992 0.520073 -0.447400 -0.354872 -0.379860 -0.415011 -0.153382 0.317442 -0.361332 -0.368364 -0.670074 -0.537298 0.206813 0.204554 0.221099 0.224490 0.224463 0.211582 0.247078 0.238094 0.211133 0.224100 0.215582 0.220806 0.220811 0.244464
chargesum: 0.00000
title: Mulliken charges with hydrogens summed into heavy atoms:
elementType: O C C C C C C C C C C C
charge: -0.264992 0.520073 -0.036033 -0.133773 -0.155370 -0.190547 0.058200 0.317442 -0.114254 -0.130270 -0.019260 0.148783
polarizability: 2.29991447e+02 -5.92393761e+00 1.12860745e+02 -6.23039479e+00 2.25274261e+00 6.70236227e+01
1716.lowfreq: -4.2050 -0.0003 0.0004 0.0011 6.8744 14.9722 33.3234 61.4783 90.4975
frequency: 33.0907 61.4744 90.4963 106.7791 117.8975 185.2733 209.0831 230.1683 248.0842 303.4235 327.0420 390.5073 417.7943 442.8175 456.2293 527.6381 560.3922 633.3919 726.2826 731.3195 775.7637 808.6838 827.6952 837.2064 857.8799 904.4840 938.8480 963.3219 980.4181 988.2701 1000.9273 1026.8890 1065.3296 1109.0326 1112.9356 1138.2744 1158.1885 1181.1087 1219.1971 1237.8706 1239.8306 1284.0430 1297.2292 1315.7712 1331.1663 1381.5070 1386.7130 1426.9686 1436.6187 1464.0380 1466.3009 1473.6302 1473.8024 1484.4977 1502.8685 1576.3280 1621.2927 1664.0043 2957.8031 2958.9437 2977.2313 3023.1580 3044.9310 3070.4238 3072.7242 3081.5401 3085.3330 3119.1830 3124.2115 3137.4802 3159.2296 3166.0616
redmass: 2.9783 3.1389 3.0107 2.6024 2.7714 2.1489 1.6808 1.5552 1.5333 3.4073 2.7605 3.7697 2.9399 3.6390 3.7189 2.4301 4.3959 6.9344 2.8417 3.7694 1.4566 1.3841 1.4476 3.6672 1.9003 1.7166 1.3752 1.3503 1.1551 8.6077 2.6937 2.2849 1.7045 1.5189 1.2607 1.8239 1.3293 1.2608 1.7538 2.9794 1.4419 1.3270 1.3590 1.2932 1.7149 2.1964 1.5139 3.6371 1.1666 1.0763 1.0502 1.0701 1.0471 1.0662 2.4722 6.8807 6.2826 6.1048 1.0337 1.0617 1.0352 1.0966 1.1038 1.0939 1.0967 1.0937 1.0949 1.0892 1.0991 1.0876 1.0938 1.0962
irintensity: 0.9423 0.7854 0.2430 2.8032 2.2251 2.4082 2.2280 1.1868 1.1378 2.7759 1.3192 0.3295 0.1697 0.8932 1.3448 15.3449 20.1982 1.7307 3.9614 4.4512 11.9137 29.5312 33.5569 8.2918 14.5176 13.6665 3.6575 5.2461 50.7957 51.6178 10.8954 3.7432 3.1702 12.1967 0.2566 3.7589 1.0026 81.4204 35.8728 186.5724 2.5879 4.5627 1.7960 1.9304 3.0660 2.4491 10.7718 11.6103 9.9280 8.5922 13.4904 46.1736 18.6391 13.1150 120.0150 8.1654 67.8349 1.1668 89.9819 39.2057 52.8261 10.8948 50.9312 22.7580 15.0663 64.2185 64.6967 27.6412 19.2758 10.7586 20.6546 6.8230
temp: 298.150 k
press: 1.00000 atm
elementType: 8 6 6 6 6 6 6 6 6 6 6 6 1 1 1 1 1 1 1 1 1 1 1 1 1 1
symmnumber: 1
zpe: 572630.7 jmol-1
zpe.correction: 0.218104 hartree
zpe.thermalcorrener: 0.230553 hartree
zpe.thermalcorrenthalpy: 0.231497 hartree
zpe.thermalcorrgfe: 0.178711 hartree
zpe.sumelectzpe: -501.868553 hartree
zpe.sumelectthermal: -501.856104 hartree
zpe.sumelectthermalent: -501.855160 hartree
zpe.sumelectthermalfe: -501.907946 hartree
dipole: -0.5854 1.3651 0.1648
dipole: 1.4945
quadrupole: -57.4412 -67.1189 -77.4131
quadrupole: -6.9199 -1.7964 1.0507
quadrupole: 9.8832 0.2055 -10.0887 -6.9199 -1.7964 1.0507
hfenergy: -502.086657 hartree
pointgroup: C01 [X(C11H14O1)]
dipole: 0.2239241 -0.5229024 -0.1487767 debye
dipolederiv: -2.0474838 0.1122904 -0.0664963 -0.0703923 -0.3202897 -0.0109608 -0.148878 0.0005174 -0.3057166 0.0667326 0.0172534 0.007097 -0.0631306 -0.1727479 -0.0821381 -0.0366537 -0.0734003 0.0125134 -0.0052473 -0.0199237 0.0201604 0.1358785 0.1403194 -0.0161121 0.1105523 -0.0362359 0.1130519 0.2364969 0.0180992 0.0523288 0.2092584 0.0915013 0.1122262 0.112241 0.1022588 -0.1308396 0.0805125 0.0455528 0.0345292 -0.0158125 0.0846449 0.0760713 0.0150695 0.0824555 -0.1159764 0.1090834 -0.0762438 -0.0042433 0.0449396 0.1019167 0.1000037 0.0346349 0.090127 -0.1369591 0.0594369 -0.0085286 0.0114392 0.0802083 0.0697802 0.1110761 0.1135988 0.115144 -0.2390778 1.6472866 0.0612336 0.1209055 0.3692356 0.0440755 0.0076943 0.2389488 -0.0107667 0.0982123 -0.4600833 -0.0422575 -0.0304198 0.2669969 0.0462353 0.0906305 0.0710794 0.0725774 -0.1438719 -0.318801 0.0173696 0.0025082 -0.4277781 -0.0596418 0.0244037 -0.1523957 0.050164 -0.1958561 -0.049153 0.0066697 0.0561539 -0.0881459 0.0951418 0.0007146 -0.0861999 0.0078198 0.0145718 0.7889513 -0.1285593 -0.0173809 -0.5206863 0.3488564 -0.0247541 -0.1468297 -0.0025019 0.3195712 0.0251335 0.0253769 0.0312025 -0.0780642 -0.1288139 -0.1188028 0.0071166 -0.0858517 0.016233 -0.1220187 0.0610339 -0.0638016 0.0325879 -0.0027994 0.1300027 -0.1030254 0.1003121 -0.0526514 0.0190687 -0.0205279 -0.0170549 -0.0961896 -0.0856085 -0.0913285 -0.0427596 -0.0862976 0.112904 0.0055962 0.1147108 0.0271884 0.0872413 -0.003918 -0.044188 0.0184706 -0.0419685 0.1265247 0.0519893 -0.0796416 -0.0361572 -0.0647484 -0.0615809 -0.0772429 -0.0306619 -0.0789614 0.1201702 0.034555 -0.0448705 -0.0217179 -0.0661091 -0.0887082 -0.0942947 -0.0530291 -0.0998636 0.1155829 0.0624949 -0.0560506 -0.0257818 -0.0655484 -0.022668 -0.0692085 -0.0305541 -0.0693554 0.1421332 -0.0233805 0.100754 0.0221914 0.1173159 0.0093823 -0.0469367 0.0263984 -0.0475085 0.1534779 0.1190763 -0.0398119 -0.003081 0.017691 -0.1376964 -0.1149119 0.0127789 -0.0742318 0.0257416 0.0927618 0.0699435 -0.0672957 0.0414732 -0.0150388 0.1222712 -0.0087088 0.095422 -0.0540728 -0.2944916 -0.0460106 -0.0023657 -0.0662579 0.0888964 -0.0111539 0.0042065 -0.0176658 0.0597107 0.0374274 0.0034962 -0.0439883 0.1553832 0.0257778 -0.062489 0.0928031 -0.0717382 -0.1543903 0.0344827 -0.0446295 0.0486598 0.1589357 -0.1125059 0.1157988 0.0340328 0.1027541 -0.0121798 -0.1504268 -0.0467287 -0.0345797 -0.0942821 0.0654893 -0.0263708 -0.0522355 -0.0232049 0.1111928 unknown
polarizability: 229.8586119|-9.0252024|107.8260392|2.535562|14.7476062|72.191163 unknown
InChI: InChI=1S/C11H14O/c1-3-4-5-10-6-8-11(12-2)9-7-10/h4-9H,3H2,1-2H3
charge 0 multiplicity 1
26 atoms
O  3.734329 0.520282 0.38035
C  -0.413944 -0.267207 -0.185888
C  -4.355263 -0.092636 -0.370032
C  -1.848035 -0.554231 -0.386371
C  0.079966 0.988627 0.281904
C  0.542408 -1.278491 -0.468714
C  -2.904733 0.275731 -0.147905
C  2.387299 0.184949 0.168633
C  1.452796 1.214306 0.457289
C  1.928934 -1.07083 -0.297733
C  -5.197106 -0.013405 0.931449
C  4.736869 -0.508873 0.098265
H  -4.421578 -1.1123 -0.796294
H  -4.80202 0.594708 -1.119201
H  -2.072336 -1.561111 -0.772518
H  -0.620158 1.799787 0.509485
H  0.193033 -2.25375 -0.830795
H  -2.728454 1.288576 0.247162
H  1.832135 2.176629 0.815118
H  2.627959 -1.880887 -0.527101
H  -5.155142 1.001458 1.36939
H  -4.816833 -0.72295 1.687909
H  -6.257896 -0.253107 0.731857
H  4.714362 -0.812378 -0.966788
H  4.590938 -1.399859 0.739916
H  5.704269 -0.039539 0.32981
