program: Gaussian 09
title: 000252577
version: EM64L-G09RevD.01
frameworkgroup: C1[X(C11H12O4)]
method: RPBEPBE
basis: SDD
operation: Freq
keyword: #pfreq=noraman
keyword: PBEPBE/SDD
title: #p freq=noraman PBEPBE/SDD
converged: YES YES NO NO
title: Mulliken charges:
elementType: O O O O C C C C C C C C C C C H H H H H H H H H H H H
charge: -0.281809 -0.243656 -0.254723 -0.192431 0.181999 -0.393128 0.372239 0.163166 0.136510 -0.259476 -0.379281 -0.256142 -0.663204 -0.760004 -0.153676 0.278695 0.221256 0.234420 0.266091 0.215571 0.250741 0.235270 0.260255 0.251371 0.254339 0.247959 0.267647
chargesum: 0.00000
title: Mulliken charges with hydrogens summed into heavy atoms:
elementType: O O O O C C C C C C C C C C C
charge: -0.281809 -0.243656 -0.254723 -0.192431 0.181999 -0.114433 0.372239 0.163166 0.136510 0.196200 -0.113190 0.004113 0.038378 -0.006335 0.113971
polarizability: 2.39763863e+02 -8.11487398e+00 1.26910242e+02 6.10124331e+00 2.73942815e+00 8.20073378e+01
1716.lowfreq: -5.1858 -1.7430 -0.0008 0.0003 0.0006 7.4474 36.8634 43.3104 51.4259
frequency: 36.8488 43.3051 51.4182 68.9356 81.5437 94.5381 108.8982 122.6060 133.3560 195.6349 203.5281 219.0453 283.1367 310.9461 336.3749 368.0827 430.0890 486.2854 539.1570 576.1612 587.1118 664.8847 673.8091 704.1189 723.4142 735.9630 744.7623 813.6367 820.2553 839.7350 870.3001 883.1079 888.0262 942.1805 951.8262 983.1404 1012.0197 1019.3634 1040.3453 1052.8263 1095.1725 1134.3639 1155.9112 1163.9667 1179.3094 1225.1856 1276.0176 1277.6273 1336.3963 1353.5189 1363.7486 1375.0737 1390.2571 1438.6364 1449.6719 1456.1335 1461.6062 1464.0836 1484.9163 1535.7208 1594.8724 1619.9870 1650.2752 2986.7792 2993.9316 3028.9145 3077.1487 3089.8212 3094.2181 3114.0369 3118.9555 3120.0497 3221.3590 3236.5064 3268.2088
redmass: 4.3010 4.3497 3.6955 4.3710 4.4051 5.6221 4.6240 1.5438 1.7350 3.1733 3.5170 1.6955 4.1450 3.2904 4.1670 5.1909 3.6156 3.5791 3.9492 5.6025 3.0514 4.3401 4.0698 4.5662 5.8481 3.6504 1.2582 1.2896 1.3359 3.7160 6.2920 4.1077 1.3766 1.8361 2.0402 1.9476 2.2411 1.6854 2.8788 2.3827 2.1553 1.6117 1.7151 4.4034 2.0643 1.9346 3.0348 1.2692 1.8451 1.2872 1.3153 2.3734 1.2301 1.0816 1.0543 1.1514 1.0535 4.1181 1.0522 6.1312 9.6740 8.8157 8.7947 1.0353 1.0361 1.0594 1.0966 1.0974 1.1034 1.0889 1.1014 1.1056 1.0930 1.0980 1.1084
irintensity: 2.9559 2.4330 2.6412 2.2303 0.1843 0.3945 0.1586 0.1957 0.1780 3.0265 2.2834 1.9673 3.7967 9.7293 7.4934 6.9983 9.9300 4.2935 3.4813 11.6295 11.0489 3.7645 6.0079 1.4850 10.9900 19.4741 85.8806 1.1836 22.6057 21.4914 5.4285 10.4877 0.3173 7.2949 19.6147 9.5471 25.8808 57.8064 111.2543 68.9289 38.2184 3.4493 80.9588 451.8390 139.6153 103.1544 9.0249 13.2458 2.2799 8.0781 79.6706 9.2169 23.8154 22.0593 17.1279 37.5777 10.0504 25.3817 13.7149 38.0845 302.5157 111.8491 97.1175 1.9190 22.1945 37.5806 6.5111 38.3823 0.8321 0.2663 8.4917 35.5604 3.2332 0.9047 0.0331
temp: 298.150 k
press: 1.00000 atm
elementType: 8 8 8 8 6 6 6 6 6 6 6 6 6 6 6 1 1 1 1 1 1 1 1 1 1 1 1
symmnumber: 1
zpe: 541149.3 jmol-1
zpe.correction: 0.206113 hartree
zpe.thermalcorrener: 0.221704 hartree
zpe.thermalcorrenthalpy: 0.222648 hartree
zpe.thermalcorrgfe: 0.161383 hartree
zpe.sumelectzpe: -726.118097 hartree
zpe.sumelectthermal: -726.102506 hartree
zpe.sumelectthermalent: -726.101562 hartree
zpe.sumelectthermalfe: -726.162828 hartree
dipole: 1.7911 -0.3149 -2.2649
dipole: 2.9046
quadrupole: -58.4821 -89.1361 -92.4119
quadrupole: -4.5249 0.9697 -6.2100
quadrupole: 21.5279 -9.1260 -12.4019 -4.5249 0.9697 -6.2100
hfenergy: -726.3242104 hartree
pointgroup: C01 [X(C11H12O4)]
dipole: 0.7097174 0.4208364 0.7906333 debye
polarizability: 239.4952857|6.2875391|123.6644646|-9.9373865|-12.2037578|85.5216928 unknown
InChI: InChI=1S/C11H12O4/c1-3-14-11(13)10(8(2)12)7-9-5-4-6-15-9/h4-7H,3H2,1-2H3
charge 0 multiplicity 1
27 atoms
O  -2.740135 -0.325918 0.519077
O  2.48103 -0.705741 0.206956
O  -2.094573 1.814588 -0.177388
O  -0.288537 -2.266839 -0.53818
C  -0.429712 0.042863 0.146379
C  0.619047 0.882869 -0.145693
C  2.023405 0.585102 -0.168406
C  -1.796168 0.630494 0.125596
C  -0.303227 -1.451876 0.419289
C  -4.174241 0.094639 0.480095
C  3.131685 1.368905 -0.508101
C  4.307118 0.55298 -0.353753
C  -4.748856 -0.085864 -0.927698
C  -0.217669 -1.875123 1.873712
C  3.875349 -0.693236 0.081083
H  0.358835 1.921561 -0.392636
H  -4.657388 -0.569781 1.214168
H  -4.240159 1.145802 0.812144
H  3.0936 2.406126 -0.836384
H  -5.83122 0.141128 -0.919484
H  -4.258618 0.597094 -1.641305
H  -4.613969 -1.124051 -1.276032
H  5.338042 0.845821 -0.540537
H  -0.168629 -2.97275 1.951133
H  -1.100538 -1.49915 2.422282
H  0.680745 -1.428746 2.339382
H  4.378685 -1.623895 0.328498
