program: Gaussian 09
title: 000252576
version: EM64L-G09RevD.01
frameworkgroup: C1[X(C10H20O2)]
method: RPBEPBE
basis: SDD
operation: Freq
keyword: #pfreq=noraman
keyword: PBEPBE/SDD
title: #p freq=noraman PBEPBE/SDD
converged: YES YES NO NO
title: Mulliken charges:
elementType: O O C C C C C C C C C C H H H H H H H H H H H H H H H H H H H H
charge: -0.289267 -0.290790 0.363562 -0.061842 0.005941 -0.401994 -0.401976 -0.710021 -0.363228 -0.699508 -0.721654 -0.699392 0.222157 0.188868 0.192978 0.225151 0.194057 0.195948 0.206040 0.227159 0.228460 0.220964 0.219113 0.209777 0.237230 0.213879 0.224943 0.233240 0.202988 0.206156 0.206771 0.214288
chargesum: 0.00000
title: Mulliken charges with hydrogens summed into heavy atoms:
elementType: O O C C C C C C C C C C
charge: -0.289267 -0.290790 0.363562 0.160315 0.194809 0.016135 -0.011970 -0.048362 0.076850 -0.038622 -0.060483 -0.072177
polarizability: 1.26510862e+02 4.76286267e-01 1.11026471e+02 -3.62658420e+00 -1.15707768e+00 1.03778205e+02
1716.lowfreq: -18.5836 -12.8855 0.0002 0.0006 0.0008 17.1070 53.0558 75.2011 84.8521
frequency: 52.8530 75.1289 84.7989 123.8717 130.0567 171.1170 192.3512 198.1368 225.6368 246.6243 257.7230 265.9513 310.9763 316.5543 349.4492 383.2205 394.9544 442.3654 467.1192 526.6637 563.8821 647.3887 697.6759 735.8280 768.2286 808.6053 858.1816 870.9384 879.6314 891.8730 916.5858 932.2453 947.1016 986.0518 1023.7205 1032.4281 1038.7545 1081.7194 1094.1613 1126.5150 1132.5049 1138.2643 1146.9246 1166.0894 1229.0164 1235.5588 1239.2991 1277.7139 1291.0139 1293.5471 1316.2131 1325.0689 1348.5880 1357.7199 1366.0418 1374.0279 1382.6744 1385.7771 1386.4057 1434.6581 1442.3414 1457.9247 1458.9262 1462.2078 1475.4256 1476.1245 1477.3884 1478.3051 1485.4109 1488.0901 2942.4923 2966.2839 2981.6130 2986.8278 2987.5089 2991.1850 2998.2425 3006.8605 3018.8345 3036.4985 3048.9235 3056.6837 3067.2223 3074.4854 3079.9504 3087.8628 3094.6976 3096.0268 3096.6276 3104.3817
redmass: 2.2144 2.0169 3.1563 2.5977 2.3837 1.1275 1.5859 1.2942 1.2306 2.1127 2.0137 1.3621 3.0975 2.6185 2.8099 4.8516 2.2018 3.0486 2.6146 4.2086 3.5215 2.9550 2.5949 2.0166 1.5562 2.7953 2.3644 1.8687 1.4428 2.0363 2.5145 2.1938 1.6438 1.5396 1.3345 1.4716 2.2711 3.1112 2.6360 2.0710 1.8830 2.6408 2.6406 1.9989 2.0469 1.2812 1.6534 1.5282 1.3116 1.2228 1.2769 1.3734 1.2145 1.6111 1.5700 1.2430 1.2154 1.2175 1.2467 1.0943 1.0817 1.0485 1.0561 1.0476 1.0554 1.0437 1.0471 1.0475 1.0501 1.0854 1.0826 1.0356 1.0371 1.0581 1.0403 1.0552 1.0370 1.0600 1.0864 1.0989 1.1010 1.1023 1.0984 1.0985 1.1035 1.0995 1.0999 1.1001 1.0997 1.0989
irintensity: 0.0563 0.2022 1.9153 0.2755 1.1714 0.1554 1.8933 0.6702 0.5615 2.0160 0.2400 1.4677 1.5336 2.2524 0.1119 9.5868 1.0420 1.2511 2.0188 7.2335 3.6560 4.7012 3.2984 0.6616 27.1857 13.3284 15.2750 6.5791 14.3153 12.1845 31.5171 19.5273 13.6329 6.2574 4.1523 18.6109 22.2482 21.7947 68.5649 85.0962 5.1907 12.2040 44.2790 29.0185 73.0377 3.6948 13.4784 21.5444 14.3152 8.0836 4.8483 6.4799 1.2566 10.8248 11.5702 10.6353 39.0522 10.5767 24.5375 8.5768 4.7359 7.6218 6.7820 6.6173 14.5660 5.7106 4.0020 13.1089 5.6558 10.8802 40.8852 46.8205 20.4109 18.9673 10.2816 38.1886 23.4299 28.6386 29.5060 11.2927 2.2495 25.0792 52.8045 62.4492 66.7220 33.5022 26.8644 30.3970 18.1382 50.2501
temp: 298.150 k
press: 1.00000 atm
elementType: 8 8 6 6 6 6 6 6 6 6 6 6 1 1 1 1 1 1 1 1 1 1 1 1 1 1 1 1 1 1 1 1
symmnumber: 1
zpe: 743895.0 jmol-1
zpe.correction: 0.283335 hartree
zpe.thermalcorrener: 0.297733 hartree
zpe.thermalcorrenthalpy: 0.298677 hartree
zpe.thermalcorrgfe: 0.243193 hartree
zpe.sumelectzpe: -542.501186 hartree
zpe.sumelectthermal: -542.486788 hartree
zpe.sumelectthermalent: -542.485844 hartree
zpe.sumelectthermalfe: -542.541328 hartree
dipole: 2.3757 -0.1125 0.1433
dipole: 2.3826
quadrupole: -71.8871 -76.7909 -74.0844
quadrupole: 0.6907 -2.0944 -1.6758
quadrupole: 2.3671 -2.5368 0.1697 0.6907 -2.0944 -1.6758
hfenergy: -542.7845207 hartree
pointgroup: C01 [X(C10H20O2)]
dipole: -0.9327144 0.0614607 0.0706151 debye
polarizability: 126.6112017|0.0142213|110.9095683|3.3711245|1.3811085|103.794768 unknown
InChI: InChI=1S/C10H20O2/c1-5-6-10(4)11-8(2)7-9(3)12-10/h8-9H,5-7H2,1-4H3
charge 0 multiplicity 1
32 atoms
O  0.00088 1.197253 -0.502361
O  -0.047557 -1.017443 0.541924
C  0.412456 0.380221 0.659995
C  -1.391129 1.059681 -1.008752
C  -1.490734 -1.168401 0.231218
C  -1.789953 -0.433553 -1.08941
C  1.951359 0.317905 0.593636
C  -0.066041 1.0039 1.990793
C  2.512133 -0.271981 -0.716757
C  -2.40662 1.938885 -0.245613
C  -1.744388 -2.675283 0.161706
C  4.053914 -0.348803 -0.700955
H  -1.298562 1.464934 -2.03331
H  -2.09405 -0.728802 1.055746
H  -2.865639 -0.517943 -1.338841
H  -1.210036 -0.924635 -1.893277
H  2.293462 -0.289269 1.454577
H  2.336857 1.345866 0.739644
H  -1.156759 0.927024 2.129834
H  0.422072 0.485765 2.834811
H  0.210814 2.071798 2.019281
H  2.169272 0.351324 -1.562619
H  2.08037 -1.27898 -0.864622
H  -2.704952 1.510577 0.726968
H  -1.976358 2.939637 -0.068433
H  -3.321993 2.059412 -0.855571
H  -1.126812 -3.129249 -0.633434
H  -1.478554 -3.154455 1.119636
H  -2.80855 -2.881377 -0.054623
H  4.503339 0.65391 -0.565683
H  4.414589 -0.991161 0.125399
H  4.444366 -0.767256 -1.64711
