program: Gaussian 09
title: 000252575
version: EM64L-G09RevD.01
frameworkgroup: C1[X(C10H14O3)]
method: RPBEPBE
basis: SDD
operation: Freq
keyword: #pfreq=noraman
keyword: PBEPBE/SDD
title: #p freq=noraman PBEPBE/SDD
converged: NO YES NO NO
title: Mulliken charges:
elementType: O O O C C C C C C C C C C H H H H H H H H H H H H H H
charge: -0.227325 -0.227325 -0.204137 0.283223 -0.370093 -0.370091 -0.693856 -0.732409 -0.117843 0.393145 -0.433932 -0.261714 -0.167567 0.183451 0.234271 0.234271 0.183450 0.269391 0.201424 0.201419 0.220733 0.220733 0.209520 0.203782 0.256418 0.252555 0.258505
chargesum: 0.00000
title: Mulliken charges with hydrogens summed into heavy atoms:
elementType: O O O C C C C C C C C C C
charge: -0.227325 -0.227325 -0.204137 0.283223 0.047630 0.047630 -0.021621 -0.081424 0.085940 0.393145 -0.177514 -0.009159 0.090938
polarizability: 1.53150293e+02 -1.69801955e+00 1.05574289e+02 4.33725294e-04 -1.40692115e-04 8.14156424e+01
1716.lowfreq: -8.0319 -0.0009 -0.0008 -0.0003 5.9082 14.0733 50.1027 56.4606 90.2010
frequency: 50.0770 56.4516 90.1918 171.8909 180.9310 207.6277 219.2492 244.1890 271.3835 316.2478 345.3699 364.6185 402.6657 402.7115 478.7555 526.7281 595.0438 605.1731 669.9675 735.6838 759.6198 805.0846 814.0762 855.7206 860.4515 880.7026 881.6301 897.9352 914.9961 924.6066 940.4312 941.5011 952.5635 1002.6048 1017.1203 1018.2583 1045.1771 1047.1675 1136.3007 1176.8066 1195.7396 1197.4891 1209.8226 1247.2022 1270.3749 1301.7250 1302.0112 1336.2194 1340.7704 1358.6689 1370.2881 1375.4636 1397.1825 1446.9157 1452.5313 1465.5073 1470.2166 1480.0925 1487.2147 1487.4192 1602.5641 2880.9454 2912.5790 2923.9134 2964.8305 2976.1949 3057.5093 3061.7097 3066.7145 3073.8786 3076.7834 3101.3500 3215.9933 3231.1642 3265.4999
redmass: 4.2928 4.1228 4.5549 3.7919 1.0375 2.8741 1.2588 4.4677 2.1562 3.9493 3.6579 2.8470 1.8649 2.2565 6.1927 4.7641 2.9793 6.4995 5.3007 1.2609 3.9426 3.3546 1.4261 3.1306 6.7979 1.4588 5.2216 2.0206 2.8213 2.9397 1.8033 1.3844 3.4770 2.3366 1.9215 1.4458 2.8674 2.3950 1.6005 1.8655 1.2321 1.8846 1.6030 3.0037 2.2666 1.8856 1.1406 1.2054 1.9670 1.3650 2.1422 1.2358 1.2087 1.0791 1.0807 1.0481 1.0701 1.0600 4.5423 1.0607 6.8749 1.0825 1.0682 1.0683 1.0356 1.0372 1.0987 1.0997 1.0983 1.0947 1.0957 1.0982 1.0928 1.0984 1.1084
irintensity: 0.1766 1.2316 3.6100 2.4467 0.3715 3.3365 0.1692 1.2707 0.2734 3.3804 0.0029 0.8113 2.1534 0.1337 6.2236 1.7036 6.1020 5.3048 1.0687 81.2426 7.0418 13.1874 78.1228 33.6239 38.0493 0.9102 14.3501 38.7346 2.6371 4.4764 34.9088 5.4897 0.3023 44.5125 117.3179 0.4544 99.7344 34.5192 19.5823 10.4660 2.7376 0.2962 2.6210 18.9311 1.8471 23.6559 1.2857 0.0427 52.7476 3.6957 11.6222 24.0029 21.7748 5.9668 0.7480 0.6561 14.1656 11.2425 13.4472 24.1639 13.5197 58.9201 23.3845 132.3328 42.1767 31.9858 31.2609 2.7508 13.2244 77.8462 29.7511 14.2666 4.0257 0.5458 0.6631
temp: 298.150 k
press: 1.00000 atm
elementType: 8 8 8 6 6 6 6 6 6 6 6 6 6 1 1 1 1 1 1 1 1 1 1 1 1 1 1
symmnumber: 1
zpe: 582654.3 jmol-1
zpe.correction: 0.221921 hartree
zpe.thermalcorrener: 0.234284 hartree
zpe.thermalcorrenthalpy: 0.235228 hartree
zpe.thermalcorrgfe: 0.183373 hartree
zpe.sumelectzpe: -614.078725 hartree
zpe.sumelectthermal: -614.066363 hartree
zpe.sumelectthermalent: -614.065418 hartree
zpe.sumelectthermalfe: -614.117274 hartree
dipole: 1.3722 -1.9509 -0.0001
dipole: 2.3851
quadrupole: -61.5606 -72.8622 -82.9150
quadrupole: -1.0005 0.0003 -0.0003
quadrupole: 10.8854 -0.4163 -10.4691 -1.0005 0.0003 -0.0003
hfenergy: -614.3006465 hartree
pointgroup: C01 [X(C10H14O3)]
dipole: 0.5387488 -0.7683168 0.000699 debye
polarizability: 153.1452031|-1.7678822|105.579358|0.0032213|-0.0225688|81.4156635 unknown
InChI: InChI=1S/C10H14O3/c1-10(2)6-12-9(13-7-10)8-4-3-5-11-8/h3-5,9H,6-7H2,1-2H3
charge 0 multiplicity 1
27 atoms
O  0.417837 -0.095399 1.212827
O  0.417858 -0.097753 -1.212527
O  -2.011754 1.054928 -0.000948
C  2.601614 0.13267 -0.000067
C  1.858011 -0.425963 1.243306
C  1.858019 -0.428427 -1.242341
C  2.561011 1.679045 -0.001622
C  4.057614 -0.386123 0.000463
C  -0.201654 -0.64157 0.000675
C  -1.650527 -0.306065 0.000321
C  -2.791669 -1.090615 0.000925
C  -3.927329 -0.192017 0.000181
C  -3.414976 1.09446 -0.001115
H  1.981524 -1.533363 1.292393
H  2.235924 0.021893 2.177335
H  2.235961 0.017543 -2.177259
H  1.981496 -1.535925 -1.289203
H  1.518713 2.038553 -0.002119
H  3.07126 2.0835 0.893082
H  3.07149 2.081679 -0.897017
H  4.602556 -0.02543 -0.892217
H  4.602518 -0.023678 0.892458
H  4.099726 -1.492997 0.001557
H  -0.070814 -1.752483 0.001751
H  -2.822127 -2.178901 0.001889
H  -4.979896 -0.46822 0.000453
H  -3.856084 2.087459 -0.00208
