program: Gaussian 09
title: 000252574
version: EM64L-G09RevD.01
frameworkgroup: C1[X(C10H13NO4)]
method: RPBEPBE
basis: SDD
operation: Freq
keyword: #p
keyword: freq=noraman
keyword: PBEPBE/SDD
title: #p freq=noraman PBEPBE/SDD
converged: YES YES NO NO
title: Mulliken charges:
elementType: O O O O N C C C C C C C C C C H H H H H H H H H H H H H
charge: -0.294548 -0.239210 -0.424356 -0.254673 -0.375586 -0.045626 -0.290762 -0.688465 -0.694402 0.290964 0.207726 -0.466623 -0.390941 0.284213 0.110034 0.208157 0.220426 0.237113 0.214507 0.218110 0.226849 0.223018 0.212889 0.215151 0.268080 0.285672 0.357375 0.384908
chargesum: 0.00000
title: Mulliken charges with hydrogens summed into heavy atoms:
elementType: O O O O N C C C C C C C C C C
charge: -0.294548 -0.239210 -0.039449 -0.254673 -0.018211 0.162531 0.166776 -0.028999 -0.043344 0.290964 0.207726 -0.198543 -0.105268 0.284213 0.110034
polarizability: 1.81848287e+02 1.19504606e+01 1.42352850e+02 -1.17645940e+01 -3.46606358e+00 7.85715023e+01
1716.lowfreq: -10.6602 -7.5666 0.0005 0.0007 0.0008 3.2626 20.1000 32.0494 42.4618
frequency: 19.9869 31.8972 42.4079 63.4079 124.0345 148.4013 172.4433 185.5080 219.5753 221.9293 240.1458 253.5080 309.3814 318.4313 353.3855 363.9696 389.1604 412.5340 478.6933 507.3206 512.4108 550.8220 576.6530 623.6408 676.8334 715.7851 728.2739 763.3265 811.3357 812.8941 847.7868 900.3761 903.5151 920.3251 928.1893 949.6092 960.1118 968.2861 1008.6951 1061.2553 1132.5808 1133.2634 1166.9930 1177.8010 1184.8376 1205.0143 1228.1156 1251.6625 1291.6146 1301.0767 1344.6227 1358.6969 1380.1122 1398.1211 1412.3763 1456.7936 1468.0879 1469.3560 1481.6374 1487.9361 1490.1659 1550.2966 1599.1946 1628.9336 1660.4350 2974.5440 2980.5574 2983.5763 3014.8416 3066.8157 3076.0201 3081.2992 3082.1868 3091.6695 3194.8928 3200.3429 3515.0625 3602.4036
redmass: 3.9113 4.1045 3.4841 5.5277 4.3622 5.0931 4.9920 1.1228 3.6606 1.2153 3.2519 6.0908 3.8274 5.5664 1.1153 2.7401 6.5153 1.9337 4.7093 5.7448 6.6201 8.6941 4.5654 4.4949 1.9452 6.3222 2.7843 2.2367 1.7531 2.2964 6.0029 1.5056 1.7309 1.2283 2.9025 1.8588 2.2537 2.3721 4.3694 2.3558 2.1235 1.4779 1.9150 2.6082 1.8457 3.3107 1.8158 1.2033 1.3484 1.5704 1.4164 1.3628 1.2091 1.2206 3.1354 1.0818 1.0484 1.0649 1.0526 1.0634 3.6700 8.8333 4.9277 10.6476 7.8497 1.0356 1.0359 1.0840 1.0567 1.1001 1.1005 1.0999 1.0989 1.1075 1.0923 1.0936 1.0770 1.0665
irintensity: 1.5012 0.0749 0.2817 0.0482 0.4029 1.2642 0.7712 0.1176 1.2690 0.5208 1.6989 2.4625 15.3777 1.9518 166.0485 1.5618 12.1821 2.5667 3.8458 2.7728 19.6725 1.6636 2.0860 0.1794 22.0244 14.5876 23.7862 82.1372 34.9496 25.5760 2.4667 26.3996 5.2659 9.4866 3.9138 20.1404 82.6289 81.3305 49.0699 85.4451 28.8027 188.0525 3.5638 339.5995 2.6452 16.9355 44.5527 10.2530 0.2992 3.3348 2.3189 7.3249 17.2061 13.9603 24.0407 4.7766 4.6199 15.0676 11.9389 24.3186 37.1950 136.9280 467.1288 94.9399 367.5214 35.6738 18.2331 16.2531 39.6578 27.9715 10.1310 43.4284 58.2376 26.8127 1.8974 12.2367 79.4906 67.6547
temp: 298.150 k
press: 1.00000 atm
elementType: 8 8 8 8 7 6 6 6 6 6 6 6 6 6 6 1 1 1 1 1 1 1 1 1 1 1 1 1
symmnumber: 1
zpe: 575404.9 jmol-1
zpe.correction: 0.219160 hartree
zpe.thermalcorrener: 0.234588 hartree
zpe.thermalcorrenthalpy: 0.235532 hartree
zpe.thermalcorrgfe: 0.174730 hartree
zpe.sumelectzpe: -743.392521 hartree
zpe.sumelectthermal: -743.377094 hartree
zpe.sumelectthermalent: -743.376150 hartree
zpe.sumelectthermalfe: -743.436952 hartree
dipole: 3.9781 6.4252 -0.4554
dipole: 7.5707
quadrupole: -93.0274 -89.5376 -88.9447
quadrupole: -11.9152 1.0830 -0.3373
quadrupole: -2.5241 0.9656 1.5585 -11.9152 1.0830 -0.3373
hfenergy: -743.6116816 hartree
pointgroup: C01 [X(C10H13N1O4)]
dipole: -1.5949363 -1.8072975 -1.7497435 debye
polarizability: 180.5546734|-2.113071|114.8985439|20.7350692|30.8637309|107.319422 unknown
InChI: InChI=1S/C10H13NO4/c1-6(2)5-15-10(14)7-3-8(12)11-9(13)4-7/h3-4,6,11-12H,5H2,1-2H3
charge 0 multiplicity 1
28 atoms
O  -1.551361 0.081304 -0.754475
O  -1.080183 1.777803 0.786573
O  2.82996 -2.413889 -1.451482
O  3.980197 0.884228 1.591772
N  3.269382 -0.732521 0.054933
C  -3.885825 -0.581034 -0.190196
C  -2.984977 0.497043 -0.82157
C  -3.585723 -0.768597 1.313715
C  -5.364863 -0.189946 -0.429685
C  0.689164 0.248359 0.071188
C  -0.708071 0.799516 0.098041
C  1.008509 -0.884245 -0.754809
C  1.647521 0.869522 0.869155
C  2.319692 -1.340356 -0.729641
C  3.026346 0.403819 0.908888
H  -3.685973 -1.538249 -0.713949
H  -3.193961 0.613005 -1.899205
H  -3.095012 1.467512 -0.304113
H  -4.249372 -1.537704 1.748935
H  -3.743051 0.175288 1.86826
H  -2.542239 -1.089839 1.480507
H  -6.038778 -0.966595 -0.026325
H  -5.589439 -0.07185 -1.506448
H  -5.60902 0.762584 0.078013
H  0.242435 -1.354263 -1.372506
H  1.384416 1.728775 1.489897
H  4.228336 -1.096977 0.047973
H  2.131488 -2.835591 -2.009948
