program: Gaussian 09
title: 000252573
version: EM64L-G09RevD.01
frameworkgroup: C1[X(C10H11Cl3N2O2)]
method: RPBEPBE
basis: SDD
operation: Freq
keyword: #p
keyword: freq=noraman
keyword: PBEPBE/SDD
title: #p freq=noraman PBEPBE/SDD
converged: YES YES NO NO
title: Mulliken charges:
elementType: Cl Cl Cl O O N N C C C C C C C C C C H H H H H H H H H H H
charge: 0.085702 0.098690 0.131589 -0.388252 -0.283048 -0.394838 -0.490387 0.004314 0.503803 0.497044 -0.652976 0.318488 -0.605525 -0.365751 -0.388768 -0.205864 -0.806954 0.305043 0.314278 0.219211 0.297565 0.306091 0.231233 0.224762 0.232052 0.233720 0.220482 0.358297
chargesum: 0.00000
title: Mulliken charges with hydrogens summed into heavy atoms:
elementType: Cl Cl Cl O O N N C C C C C C C C C C
charge: 0.085702 0.098690 0.131589 -0.029955 -0.283048 -0.080560 -0.192822 0.309357 0.503803 0.497044 -0.433765 0.318488 -0.605525 -0.059660 -0.157535 0.018898 -0.120700
polarizability: 2.47694826e+02 1.00740838e+01 1.55406724e+02 1.70127239e+01 -6.96424334e+00 1.03434046e+02
1716.lowfreq: -14.7618 -8.8137 -1.0495 -0.0025 -0.0023 -0.0018 4.9929 19.8161 23.5394
frequency: -13.0305 16.4272 23.5319 40.3896 66.7606 74.8782 101.2379 160.9056 166.2684 177.0110 210.2400 222.2838 234.8718 249.5004 266.2006 273.3179 301.6639 320.8702 364.6744 384.2665 393.9334 435.9104 442.7745 514.7372 528.3272 552.4180 579.3266 617.1991 630.5862 687.4811 699.4635 708.4674 726.6206 761.4090 801.9602 805.4389 866.2865 905.0218 918.4384 969.5753 983.7674 987.6018 991.8995 1003.4081 1024.3774 1046.3707 1096.8392 1117.7685 1182.0341 1183.6234 1206.1887 1252.4392 1284.3621 1303.8779 1317.8716 1350.7354 1385.5346 1396.6617 1412.4056 1469.4575 1471.2463 1476.2059 1491.4960 1533.5639 1604.9577 1622.0317 1652.9115 2978.4279 3015.9551 3058.3302 3083.3177 3096.3395 3124.5698 3149.1839 3197.5955 3525.5663 3536.1489 3541.8097
redmass: 1.0862 4.2907 7.0431 11.9414 7.1312 6.9099 5.6028 9.2095 11.0536 6.7519 2.9610 6.2914 3.2362 12.4687 8.3924 5.3664 7.4409 1.7621 1.8972 5.0472 3.2898 2.9351 2.9156 4.9568 3.4471 4.1619 3.8542 1.8173 3.2808 7.8701 2.1048 10.0772 7.7506 9.0729 1.4345 5.4473 1.4694 4.1227 1.3839 3.7327 4.4811 2.9959 1.3245 5.5820 2.6171 1.5568 1.5812 1.8242 1.4894 1.1801 1.7486 1.7468 2.4534 1.2851 1.4370 1.4212 5.9019 1.2858 2.3034 1.0739 1.3651 1.8136 1.8162 2.1935 5.1873 6.2697 4.7298 1.0370 1.0845 1.0976 1.0990 1.0911 1.0874 1.0960 1.0949 1.0764 1.0663 1.0758
irintensity: 0.6433 0.2373 0.0617 0.5164 1.5282 6.4013 1.6814 3.4592 0.0642 1.2675 3.6705 8.4124 2.3033 2.3259 7.8407 10.2314 15.5689 63.3953 100.6762 11.1265 1.6315 29.8236 37.9920 0.2723 24.1185 48.7799 59.5567 111.8924 89.6184 69.7725 30.7316 31.1264 65.4859 110.3517 45.4636 36.9226 18.5901 8.8694 8.7863 81.5412 0.7210 58.6457 3.8559 18.9673 4.9458 14.5891 17.9718 82.2632 43.9726 22.2183 147.7865 343.7475 14.6013 9.9247 28.0071 18.6690 75.2155 30.3129 18.0780 15.6537 49.2328 562.9812 92.7181 433.1583 16.7979 139.5297 126.7570 35.9903 21.5452 20.0312 15.0412 26.9544 8.6211 24.4925 5.7799 8.4325 14.1426 29.2703
temp: 298.150 k
press: 1.00000 atm
elementType: 17 17 17 8 8 7 7 6 6 6 6 6 6 6 6 6 6 1 1 1 1 1 1 1 1 1 1 1
symmnumber: 1
zpe: 522514.2 jmol-1
zpe.correction: 0.199015 hartree
zpe.thermalcorrener: 0.216381 hartree
zpe.thermalcorrenthalpy: 0.217326 hartree
zpe.thermalcorrgfe: 0.150871 hartree
zpe.sumelectzpe: -2026.539108 hartree
zpe.sumelectthermal: -2026.521741 hartree
zpe.sumelectthermalent: -2026.520797 hartree
zpe.sumelectthermalfe: -2026.587252 hartree
dipole: 1.3349 2.6052 -0.6782
dipole: 3.0048
quadrupole: -108.4728 -115.0916 -125.9532
quadrupole: 8.9534 4.3367 -0.3237
quadrupole: 8.0331 1.4143 -9.4474 8.9534 4.3367 -0.3237
hfenergy: -2026.7381227 hartree
pointgroup: C01 [X(C10H11Cl3N2O2)]
dipole: -0.5164665 0.9421153 0.4932223 debye
polarizability: 248.4726458|-12.5884012|150.0195519|10.7086678|17.5675178|108.0433987 unknown
InChI: InChI=1S/C10H11Cl3N2O2/c1-6-3-2-4-7(5-6)14-9(17)15-8(16)10(11,12)13/h2-5,8,14-16H,1H3
charge 0 multiplicity 1
28 atoms
Cl 5.623705 -0.667256 -0.398726
Cl 4.33522 1.976582 0.366803
Cl 3.491477 0.550094 -2.17644
O  3.376171 -0.715928 1.74672
O  0.489696 -1.624357 -0.394668
N  1.690249 0.214198 0.420847
N  -0.63683 0.354091 0.241881
C  2.933023 -0.490789 0.373696
C  -2.001079 0.00727 0.009762
C  -4.347786 0.77886 0.063111
C  -2.969612 1.018934 0.255561
C  0.490677 -0.444348 0.058896
C  4.019292 0.31498 -0.41841
C  -2.413849 -1.272258 -0.439298
C  -4.754349 -0.50614 -0.385055
C  -3.793075 -1.509042 -0.629271
C  -5.374268 1.866293 0.332434
H  2.760415 -1.439693 -0.173391
H  1.687292 1.102714 0.926541
H  -2.643146 2.009702 0.602262
H  -0.48589 1.312381 0.564415
H  -1.669783 -2.045941 -0.633975
H  -5.819593 -0.713785 -0.540948
H  -4.11604 -2.497187 -0.976016
H  -6.00084 2.053805 -0.559267
H  -6.056471 1.5767 1.15381
H  -4.896004 2.820122 0.614623
H  4.191597 -1.283001 1.747501
