program: Gaussian 09
title: 000252572
version: EM64L-G09RevD.01
frameworkgroup: C1[X(C10H11ClO3)]
method: RPBEPBE
basis: SDD
operation: Freq
keyword: #p
keyword: freq=noraman
keyword: PBEPBE/SDD
title: #p freq=noraman PBEPBE/SDD
converged: YES YES NO NO
title: Mulliken charges:
elementType: Cl O O O C C C C C C C C C C H H H H H H H H H H H
charge: -0.040793 -0.243784 -0.428369 -0.252105 -0.366811 0.541439 -0.428582 -0.366579 0.231576 -0.220945 -0.218850 -0.249425 -0.238663 -0.549264 0.252781 0.231038 0.251468 0.228652 0.228073 0.234687 0.271162 0.230296 0.360551 0.261212 0.281235
chargesum: 0.00000
title: Mulliken charges with hydrogens summed into heavy atoms:
elementType: Cl O O O C C C C C C C C C C
charge: -0.040793 -0.243784 -0.067817 -0.252105 -0.114029 0.541439 -0.197545 -0.115111 0.231576 0.007708 0.009222 0.256424 -0.008367 -0.006818
polarizability: 1.25144519e+02 2.39972665e+01 1.18196600e+02 -3.21118646e+00 6.25760628e+00 1.15341687e+02
1716.lowfreq: -6.6248 -4.3434 -0.0026 -0.0020 0.0012 7.5487 10.2505 17.7924 31.1784
frequency: 5.1454 17.2142 31.1051 47.2163 92.5387 132.4487 154.5358 203.0310 231.1343 274.6919 307.0231 316.9623 355.2835 387.8968 401.7941 461.3459 499.5869 590.1683 610.5612 613.5902 664.7000 702.3014 719.2871 776.4245 803.0954 825.3392 851.7360 889.9586 924.9967 939.7717 977.3422 978.7953 990.2855 991.5997 998.3895 1026.7852 1075.8317 1083.2536 1135.5898 1173.6018 1182.2654 1190.5842 1193.4096 1229.9486 1239.9422 1272.3167 1302.0598 1337.6583 1354.6054 1380.3484 1387.8240 1431.2631 1443.8544 1453.1322 1481.3372 1595.7838 1611.1909 1631.9725 3014.9875 3059.0266 3075.1190 3092.9628 3121.5524 3124.0088 3136.1077 3144.1287 3148.6868 3165.1280 3507.2769
redmass: 4.3046 5.5156 8.6353 11.4711 6.3605 3.8083 5.5556 5.2571 3.2490 2.8984 3.0468 2.5945 2.7989 3.5816 2.6891 2.9830 4.3953 4.5776 4.9335 6.2132 6.1969 1.7202 4.9433 2.1390 3.2358 4.4542 1.2497 2.9688 1.5276 2.6240 1.3981 3.1965 3.4001 3.0714 1.3714 2.2252 2.2176 1.5946 3.0753 1.0599 1.3046 1.1921 2.3286 1.1532 1.3365 1.6178 1.2047 1.3010 1.3054 1.2887 6.1745 1.0999 2.1468 1.0873 2.2460 6.1316 6.0288 9.4212 1.0584 1.0587 1.0858 1.1050 1.0858 1.0881 1.0916 1.1095 1.0962 1.1016 1.0654
irintensity: 0.4968 2.8217 1.4308 0.4928 5.5408 3.4268 5.0723 2.2350 28.9238 13.5169 12.2030 103.9314 42.1126 15.2143 6.0688 8.3185 12.4403 32.3568 27.6408 1.5823 9.6025 62.5987 14.6535 39.1763 5.5626 6.5733 0.2422 11.7596 15.4831 23.7997 0.3563 66.0840 19.8271 57.9684 6.7554 3.2544 10.1872 8.2014 274.0514 0.3222 1.0343 3.8915 18.7587 2.8442 100.4019 26.6435 22.7066 2.2346 7.1775 20.1015 0.4382 10.7955 10.2564 25.4409 7.6172 4.0941 1.8023 152.6749 28.0937 23.5081 11.7745 3.0935 4.3758 0.4896 10.4337 8.3833 34.0926 21.8788 21.3319
temp: 298.150 k
press: 1.00000 atm
elementType: 17 8 8 8 6 6 6 6 6 6 6 6 6 6 1 1 1 1 1 1 1 1 1 1 1
symmnumber: 1
zpe: 499864.6 jmol-1
zpe.correction: 0.190388 hartree
zpe.thermalcorrener: 0.204392 hartree
zpe.thermalcorrenthalpy: 0.205336 hartree
zpe.thermalcorrgfe: 0.144568 hartree
zpe.sumelectzpe: -1072.342229 hartree
zpe.sumelectthermal: -1072.328226 hartree
zpe.sumelectthermalent: -1072.327282 hartree
zpe.sumelectthermalfe: -1072.388050 hartree
dipole: 2.3212 -1.5777 2.1797
dipole: 3.5536
quadrupole: -75.1465 -97.1404 -83.2185
quadrupole: 8.4244 5.3823 1.2604
quadrupole: 10.0219 -11.9719 1.9500 8.4244 5.3823 1.2604
hfenergy: -1072.5326179 hartree
pointgroup: C01 [X(C10H11Cl1O3)]
dipole: 0.8946616 0.7683142 -0.7509702 debye
dipolederiv: -0.2540677 0.1148172 0.0908331 0.0401583 -0.3202355 -0.087123 0.1066642 -0.1511932 -0.2687329 -1.1760101 -0.4758533 0.253436 -0.5463571 -0.6375277 0.2215261 0.3208457 0.2702476 -0.5517542 -0.6249386 0.0052269 0.1180054 0.1934967 -0.8343694 0.1360874 0.0784479 0.2307271 -0.2579229 -0.6873312 0.0237191 -0.1738658 -0.1844981 -0.4597925 0.1618288 0.0401642 0.4182559 -0.7560586 0.2310024 -0.062365 -0.1196137 -0.0731893 0.6796634 -0.0623507 -0.1809685 -0.1290224 0.2628302 -0.0733005 0.010251 0.0096033 -0.2069732 -0.0486472 -0.0088681 0.0067316 -0.0228593 -0.0522018 -0.1288434 -0.0397463 -0.0091332 -0.0049519 -0.0753159 0.0926079 0.0655263 0.0525762 0.0633113 -0.1061021 0.0112702 0.0733488 -0.0130876 -0.1015399 -0.0165275 0.0588332 -0.004624 -0.0297584 1.3253856 0.2147257 -0.0079611 0.6103145 0.5031943 -0.3646466 -0.3838974 -0.7226432 1.0208751 -0.0483593 -0.0629478 0.1045 -0.0393449 -0.0950319 -0.0383056 0.1041634 -0.051506 0.0448021 -0.0907176 -0.0547393 -0.0061097 -0.0483938 -0.0571382 0.1051543 -0.0220167 0.0944328 0.1000317 0.6609608 0.2883128 -0.0383358 0.1911377 0.296089 0.0166347 0.1430262 0.0861137 0.0999132 -0.0445448 -0.1228512 0.0005703 -0.1286659 -0.0111737 0.0347778 -0.007164 0.0413792 -0.0629242 0.2214446 -0.1843454 -0.1463592 -0.1544292 0.2920062 0.1645454 -0.1808766 0.2042009 0.3674012 0.0611453 -0.0048964 -0.0037213 -0.0089351 0.0451398 0.0044346 0.0583654 -0.001774 -0.0747977 0.115258 0.0483686 0.032545 0.0336656 0.0667084 -0.1028901 0.01042 -0.0810492 -0.0501279 0.0676076 0.0519907 -0.0918975 0.0469164 0.0946504 0.0345321 -0.0956093 0.0238227 0.0183695 0.0427657 0.0739546 -0.1008669 0.0829487 0.0948715 0.0354974 -0.1122553 0.0408503 -0.0349352 0.1120179 0.0403335 0.000752 0.0580567 0.070038 -0.0892176 0.0182381 -0.0949906 -0.0714085 -0.0729567 -0.0331641 0.0718968 0.0354036 -0.0102864 -0.075247 0.1001938 -0.0756444 0.0414638 0.0672882 -0.045126 0.0105268 0.0116504 0.0797961 0.0365155 -0.115184 0.0107428 0.0085187 0.0172914 0.1394674 0.0050828 0.1448966 0.0054238 -0.0311432 0.0067358 -0.0321128 0.0911768 0.4258259 0.0210472 -0.0879277 -0.0389426 0.3498645 -0.1121237 -0.0389822 -0.0735916 0.1101818 -0.1155084 -0.0361045 0.0310723 -0.0527385 0.0317296 -0.034484 0.015363 -0.0446943 0.0656118 0.074687 0.0786545 -0.016381 0.051862 0.0418831 -0.0212148 0.0032352 0.0123557 -0.0838648 unknown
polarizability: 129.1542317|-23.4613431|112.9903904|1.3268491|5.1373851|116.5381832 unknown
InChI: InChI=1S/C10H11ClO3/c11-6-7-14-10(13)9(12)8-4-2-1-3-5-8/h1-5,9,12H,6-7H2
charge 0 multiplicity 1
25 atoms
Cl 2.270957 2.317714 0.915037
O  1.934251 -0.52622 -0.703884
O  -0.684713 -2.81546 0.277776
O  1.544219 -1.548012 1.366628
C  -0.216575 -1.575377 -0.350374
C  -1.194429 -0.412251 -0.16027
C  -1.993918 0.016338 -1.246176
C  -1.349175 0.208287 1.105578
C  1.166568 -1.229363 0.215128
C  -2.942622 1.048926 -1.072574
C  -2.296677 1.239531 1.279508
C  3.267922 -0.037739 -0.260545
C  -3.096488 1.66242 0.191691
C  3.322417 1.474654 -0.399503
H  -0.120985 -1.806011 -1.423701
H  -1.879972 -0.463961 -2.225639
H  -0.727686 -0.106711 1.952495
H  -3.559602 1.372098 -1.918349
H  -2.409196 1.716577 2.259439
H  3.999986 -0.499594 -0.948531
H  3.457549 -0.373794 0.77331
H  -3.831091 2.463872 0.328279
H  -0.408123 -2.795506 1.233472
H  4.349617 1.842606 -0.250621
H  2.922866 1.812076 -1.366672
