program: Gaussian 09
title: 000252571
version: EM64L-G09RevD.01
frameworkgroup: C1[X(C10H11ClO2)]
method: RPBEPBE
basis: SDD
operation: Freq
keyword: #p
keyword: freq=noraman
keyword: PBEPBE/SDD
title: #p freq=noraman PBEPBE/SDD
converged: YES YES NO NO
title: Mulliken charges:
elementType: Cl O O C C C C C C C C C C H H H H H H H H H H H
charge: -0.053866 -0.301012 -0.240098 -0.006103 -0.134861 -0.334192 0.536294 -0.696461 -0.303032 -0.356019 -0.226135 -0.232253 -0.221636 0.222910 0.249427 0.200477 0.234145 0.242441 0.213679 0.217561 0.266079 0.256288 0.231397 0.234972
chargesum: 0.00000
title: Mulliken charges with hydrogens summed into heavy atoms:
elementType: Cl O O C C C C C C C C C C
charge: -0.053866 -0.301012 -0.240098 0.216807 0.114566 0.100430 0.536294 -0.022781 -0.303032 -0.089941 0.030153 -0.000856 0.013336
polarizability: 1.48234869e+02 1.15269327e+00 1.35335457e+02 3.27360813e+00 3.59432910e+00 7.08383866e+01
1716.lowfreq: -12.3532 -9.2595 -5.2134 -0.0028 -0.0011 -0.0011 23.5187 38.6453 92.5247
frequency: 23.1469 38.3289 92.5149 140.3082 164.6001 201.2827 209.0505 251.6558 290.3733 332.9536 389.3099 410.6195 449.5210 462.4577 529.1839 576.9073 603.7880 672.6323 696.2280 723.0669 760.7141 804.5191 819.4164 850.2990 880.2021 884.9443 917.1309 958.5467 958.7612 992.0354 1004.4879 1026.1042 1038.8057 1073.7394 1116.4882 1125.0194 1144.7436 1168.7046 1187.3162 1199.0080 1246.9903 1259.5060 1295.9083 1301.4896 1325.1219 1360.8213 1381.3008 1394.8856 1425.1307 1454.6334 1461.5069 1466.0929 1478.4189 1576.8034 1604.4968 2974.0554 2988.9049 2992.2177 3033.4177 3087.7420 3099.2166 3103.4085 3136.0613 3152.4243 3166.7272 3175.8462
redmass: 4.2389 4.7300 3.7330 4.6505 5.7937 4.2499 1.1324 4.7228 3.2244 4.5857 8.4716 4.6396 2.9360 2.9832 4.1772 3.7206 5.8533 6.8831 7.1437 5.0667 1.2757 3.4952 3.5432 5.0139 1.5422 1.9435 2.9784 1.5616 1.6227 1.3600 5.3136 4.5916 2.0653 2.5677 1.6897 1.6623 1.9599 1.0682 1.3991 1.7808 1.3554 1.4920 1.2856 1.1637 1.3936 1.5951 5.4800 1.2560 2.1594 2.5484 1.0680 1.0826 1.0491 6.3872 7.2549 1.0720 1.0798 1.0363 1.0870 1.0991 1.0995 1.0997 1.0859 1.0908 1.0942 1.0998
irintensity: 2.6729 1.4606 0.9224 2.9729 0.4775 4.9855 0.3982 3.8650 0.4203 2.4372 8.8454 3.3540 3.4103 7.5228 1.9267 6.8577 14.4439 18.1083 7.3030 5.9937 100.6993 13.1341 19.3767 32.9449 7.6829 1.9860 7.3350 1.4501 17.5172 4.3944 138.1677 55.3070 2.4217 86.2110 12.8087 2.6793 7.2844 5.3062 14.2987 17.0610 24.5377 24.2947 0.2256 12.1329 18.9855 2.8732 6.9732 25.2913 30.8825 20.3789 3.6232 13.9025 9.2669 16.4697 8.8297 29.7540 62.3928 21.2646 23.4859 22.3317 20.3866 42.1654 2.4957 9.3816 8.1124 15.5606
temp: 298.150 k
press: 1.00000 atm
elementType: 17 8 8 6 6 6 6 6 6 6 6 6 6 1 1 1 1 1 1 1 1 1 1 1
symmnumber: 1
zpe: 491139.1 jmol-1
zpe.correction: 0.187065 hartree
zpe.thermalcorrener: 0.199058 hartree
zpe.thermalcorrenthalpy: 0.200002 hartree
zpe.thermalcorrgfe: 0.147218 hartree
zpe.sumelectzpe: -997.180136 hartree
zpe.sumelectthermal: -997.168142 hartree
zpe.sumelectthermalent: -997.167198 hartree
zpe.sumelectthermalfe: -997.219983 hartree
dipole: -1.8571 2.4955 0.8828
dipole: 3.2335
quadrupole: -67.4053 -81.4594 -87.1933
quadrupole: 4.4904 -2.0515 3.1582
quadrupole: 11.2807 -2.7734 -8.5073 4.4904 -2.0515 3.1582
hfenergy: -997.3672006 hartree
pointgroup: C01 [X(C10H11Cl1O2)]
dipole: -0.5659935 1.0949351 0.3149152 debye
dipolederiv: -0.1454004 0.0426413 -0.0105481 0.0684685 -0.77001 -0.0309517 -0.0109279 -0.0375542 -0.0704232 -1.1791183 0.1536312 -0.0086823 0.1729077 -0.3966282 0.0124486 0.0659705 0.0425778 -0.5183724 -0.9179753 0.0360638 0.1000871 0.0208039 -0.3998903 -0.0107077 0.2021706 0.0414571 -0.5885423 0.7953016 -0.0446511 -0.0279757 0.0591991 0.3205128 0.0215112 -0.2689457 0.0788736 0.2568275 1.3780832 0.0110336 -0.0130687 0.049569 0.4677004 0.0180072 0.0299885 -0.0157154 0.6711171 0.4174268 -0.0150267 -0.127975 -0.1894691 0.2836104 0.1818971 -0.0134772 0.0434422 0.2256139 -0.2057204 0.0191209 -0.0206178 0.0503142 -0.3468092 -0.0198613 -0.1084186 -0.0564096 -0.0701861 -0.0261163 0.0754962 0.0017393 0.114836 -0.0736706 -0.001336 -0.0094916 0.0097054 0.0501307 0.1409369 -0.0059357 0.0296423 -0.188514 1.1431542 0.050944 0.0081294 0.0468952 -0.0577185 -0.0333133 0.0036959 0.0450314 -0.0265293 0.0119789 0.0121279 0.0678874 -0.0010153 -0.107151 -0.0345768 -0.0938931 0.0121231 -0.0591336 -0.3077364 -0.0223167 0.0145343 -0.026544 -0.1014225 -0.124765 0.012632 0.0136862 0.0091445 0.1051179 0.0011841 -0.0048008 0.0016096 -0.1522084 0.0732791 -0.0052602 0.0535218 0.0377408 0.0671452 0.0195844 0.0417703 0.0050666 -0.1398632 -0.128489 -0.0613517 -0.0180343 -0.1430124 -0.0962635 -0.0536893 -0.0121733 -0.0537321 -0.0026251 -0.0518419 0.0151331 0.0256003 0.0124265 -0.0564578 -0.0898979 0.0462076 -0.0414488 -0.0078223 -0.0011117 -0.0431642 -0.0425933 0.0260721 -0.1211607 -0.1511804 -0.0256267 -0.0644257 -0.0052944 -0.0324023 -0.0555226 0.1033877 -0.0551645 0.0477236 0.0667826 0.1030708 0.0317273 0.0163482 0.093003 0.0148309 -0.0458845 0.0470276 0.0630992 0.0354245 -0.0923026 0.0682796 -0.0925198 -0.0913664 0.0131579 0.1010373 -0.0117021 0.0798929 0.0245445 0.1394549 -0.0027712 0.0356687 0.0157423 -0.1299766 -0.0649049 -0.070678 -0.0314877 -0.0517658 -0.0677358 -0.0639979 0.0583511 0.0553215 0.0823402 -0.0241377 0.1069635 0.0463839 0.0011893 -0.0135273 0.0083501 0.1310069 -0.012557 0.0577679 -0.0256192 0.0756902 0.0537264 0.0102958 -0.0297338 0.0092455 0.1596 0.081095 0.0010061 -0.0136568 -0.0237331 -0.1184726 -0.0051566 -0.0189909 -0.003105 0.1574311 -0.0654353 -0.0837691 -0.0421582 -0.0832275 0.0285413 -0.0190778 -0.0430318 -0.0205108 0.1520539 unknown
polarizability: 148.2599995|-0.8178865|135.420522|3.9394662|1.155251|70.7281909 unknown
InChI: InChI=1S/C10H11ClO2/c1-7-6-12-10(13-7)8-4-2-3-5-9(8)11/h2-5,7,10H,6H2,1H3
charge 0 multiplicity 1
24 atoms
Cl 1.812614 -2.624532 -0.122644
O  -1.751453 0.071554 -1.04022
O  -1.300862 -1.376637 0.786897
C  -2.975342 -0.023738 -0.184317
C  -0.742068 -0.839779 -0.487978
C  -2.37857 -0.442345 1.172699
C  0.568441 -0.097849 -0.257215
C  -3.700011 1.318229 -0.222914
C  1.783347 -0.793828 -0.058506
C  0.614536 1.318018 -0.217594
C  3.000943 -0.134399 0.193554
C  1.821517 2.004274 0.035439
C  3.016028 1.278196 0.244848
H  -3.615094 -0.836966 -0.583453
H  -0.604222 -1.723117 -1.136616
H  -1.972754 0.434653 1.717601
H  -3.071057 -1.007516 1.815262
H  -3.976908 1.576363 -1.25907
H  -4.625794 1.273322 0.379526
H  -3.058003 2.123346 0.176234
H  -0.314275 1.860935 -0.416582
H  3.916753 -0.713124 0.344222
H  1.832655 3.099061 0.060468
H  3.958679 1.800678 0.439656
