program: Gaussian 09
title: 000252570
version: EM64L-G09RevD.01
frameworkgroup: C1[X(C10H11BrO2)]
method: RPBEPBE
basis: SDD
operation: Freq
keyword: #p
keyword: freq=noraman
keyword: PBEPBE/SDD
title: #p freq=noraman PBEPBE/SDD
converged: YES YES NO NO
title: Mulliken charges:
elementType: Br O O C C C C C C C C C C H H H H H H H H H H H
charge: -0.023690 -0.256242 -0.248518 0.481440 -0.438086 -0.454026 -0.392103 -0.377229 0.272171 -0.223339 -0.222603 -0.654536 -0.229934 0.233384 0.239344 0.271887 0.271905 0.233706 0.234577 0.295568 0.293366 0.230386 0.230052 0.232518
chargesum: 0.00000
title: Mulliken charges with hydrogens summed into heavy atoms:
elementType: Br O O C C C C C C C C C C
charge: -0.023690 -0.256242 -0.248518 0.481440 0.034642 0.089767 -0.158397 -0.142652 0.272171 0.007047 0.007450 -0.065602 0.002584
polarizability: 1.74942846e+02 1.46969865e+01 1.02494630e+02 3.65202792e+00 -2.33444734e+00 1.03071445e+02
1716.lowfreq: -0.0004 -0.0003 0.0004 3.0060 4.3713 8.8679 15.5730 22.7916 38.9458
frequency: 15.1541 22.7167 38.9362 40.8656 61.6629 114.1212 161.7110 166.6872 225.9484 263.1321 323.7419 398.6378 402.2160 502.8689 554.7767 559.3787 587.2140 617.2493 695.6793 705.6903 757.1616 763.8494 818.4663 853.8016 855.7260 911.0081 930.4062 951.5947 962.5070 977.8816 991.1534 999.6830 1027.0128 1071.6033 1089.1298 1124.1651 1128.4761 1174.1672 1188.4969 1191.6484 1228.1565 1230.6228 1262.2432 1322.7119 1326.3747 1353.3213 1386.5778 1441.2751 1446.1948 1454.5891 1472.2518 1488.0133 1596.8121 1617.5238 1625.8098 3017.8953 3020.0976 3073.4329 3077.9485 3083.4744 3123.5019 3124.9433 3137.8147 3150.6944 3163.3591 3166.9471
redmass: 4.5406 5.1582 6.2232 2.2500 4.2157 5.7541 4.1207 9.6300 7.1864 5.8421 2.1888 4.4145 2.8249 4.1931 2.9954 4.2734 6.2889 6.3320 3.7835 2.0833 1.9764 1.2568 4.5239 1.3033 4.0235 5.2351 1.5678 1.7348 1.4694 1.3933 6.2125 1.3241 2.1746 4.2817 1.5188 1.4815 2.0446 1.0541 1.1151 1.0927 1.8494 1.4729 1.1480 1.4788 1.3042 1.5734 8.6085 2.1931 1.0930 1.1005 1.1011 2.4379 6.1358 6.2277 9.4510 1.0582 1.0609 1.1002 1.0570 1.1079 1.0858 1.0884 1.0917 1.0963 1.1111 1.1016
irintensity: 0.2990 0.4536 0.1320 0.5450 1.5490 0.9246 7.2640 2.6996 15.1534 0.9208 1.3944 1.5613 0.0208 27.1464 4.5392 14.4620 24.8501 0.1648 31.6031 37.5931 91.2984 15.1442 21.2100 1.9770 29.3464 65.3519 2.9916 3.9687 0.1563 0.0130 1.1894 0.0812 3.8513 41.2079 7.5491 128.2151 294.1050 0.0228 0.1532 3.1645 37.9272 13.5073 0.6948 112.2296 15.7719 22.1731 0.5056 9.5488 31.3392 8.3052 6.7582 6.7541 0.7487 3.2252 222.9179 17.7199 8.5464 1.8358 7.7012 11.8482 5.9459 2.8643 12.4515 37.7239 4.8641 19.5152
temp: 298.150 k
press: 1.00000 atm
elementType: 35 8 8 6 6 6 6 6 6 6 6 6 6 1 1 1 1 1 1 1 1 1 1 1
symmnumber: 1
zpe: 488189.5 jmol-1
zpe.correction: 0.185942 hartree
zpe.thermalcorrener: 0.199168 hartree
zpe.thermalcorrenthalpy: 0.200113 hartree
zpe.thermalcorrgfe: 0.140692 hartree
zpe.sumelectzpe: -550.613024 hartree
zpe.sumelectthermal: -550.599797 hartree
zpe.sumelectthermalent: -550.598853 hartree
zpe.sumelectthermalfe: -550.658274 hartree
dipole: -3.4789 -0.4292 -0.1000
dipole: 3.5067
quadrupole: -85.5246 -91.5902 -78.7205
quadrupole: 4.5506 0.8454 -2.5035
quadrupole: -0.2462 -6.3118 6.5579 4.5506 0.8454 -2.5035
hfenergy: -550.7989659 hartree
pointgroup: C01 [X(C10H11Br1O2)]
dipole: -1.3790007 0.0049555 -0.0423246 debye
dipolederiv: -0.461749 0.1348931 -0.0050999 0.2640001 -0.2867341 -0.0001138 0.0065581 -0.0082122 -0.1381062 -2.1376324 -0.1006364 -0.0606776 0.0155564 -0.4734129 -0.0245294 -0.0692622 -0.0198961 -0.247849 -0.9117321 0.0265797 -0.0222094 -0.4670154 -0.8710283 -0.067114 -0.0774187 -0.0514039 -0.3013724 0.0323441 0.0393403 0.0044698 -0.053003 -0.1019975 0.006637 0.0003046 0.0055996 -0.0201384 1.1413686 0.0427474 -0.0023412 -0.302546 0.3409887 -0.0166244 -0.0553625 -0.0268549 0.3031285 -0.2327103 0.0564706 -0.0079069 0.3679208 -0.3263285 -0.0188241 0.0195147 -0.053011 0.0861058 -0.0860297 0.0538021 -0.0767596 0.043308 -0.1118761 -0.0478831 0.0065407 -0.0374564 0.0502432 -0.0621592 0.0422878 0.095362 0.0235897 -0.1256972 0.015758 0.0229426 0.002821 0.0374269 2.0688559 0.0327658 0.0811343 0.5488549 1.1510119 0.1020891 0.170079 0.1013219 0.2064284 -0.0574861 0.0376421 0.108302 0.0382999 -0.1254327 0.0300261 0.1246048 0.0250392 0.0637566 -0.0882373 0.0449227 -0.0772831 0.0531802 -0.1102579 -0.0708604 -0.0922459 -0.061738 0.0796297 0.5789884 -0.3266745 -0.0081464 -0.4050082 0.4269021 0.0065096 -0.013334 0.01606 0.1138694 0.0342618 0.1167855 0.001284 0.100814 -0.0910181 -0.012794 0.0018427 -0.0121617 -0.0445828 -0.0515026 -0.0069406 0.0099502 0.0856815 0.0146299 0.0487996 0.0267 0.11011 -0.0533817 -0.0436465 -0.0294942 -0.0243659 0.0932539 0.0235344 -0.0387654 -0.0166267 -0.0953727 -0.0375669 0.0447739 -0.0062986 0.0420382 -0.0669989 0.052533 0.0599682 0.0319507 0.0810243 0.0338814 0.0570625 0.0187464 -0.0314844 -0.0435649 0.0849646 -0.0529213 -0.0410842 -0.0622421 -0.0129825 0.0794428 -0.0598536 0.0804272 -0.0542399 0.1081248 0.0656343 0.069856 0.054053 -0.0486853 0.0566447 -0.0493466 -0.1018152 -0.0492451 0.1195535 -0.0305462 -0.0972406 -0.0197815 -0.0353767 0.0055067 0.069586 0.0088274 0.0115011 -0.0439089 0.0732043 0.0364327 0.0607244 0.0262273 0.0082604 0.0803463 0.0126019 0.0370361 -0.0095288 -0.0783935 -0.0292084 -0.0582806 -0.0204199 0.034546 -0.0479036 -0.0901916 -0.0558606 0.1352282 -0.0188745 -0.1067824 -0.0227917 -0.058638 0.0605008 -0.0539273 0.0617661 -0.0627066 0.1218626 0.0591949 0.078553 0.0624064 -0.070768 -0.0696716 -0.1158403 0.0021178 -0.122808 0.0978873 0.0104234 0.0026859 0.0100432 0.0891705 unknown
polarizability: 177.4779292|5.2457432|99.5513394|3.0732601|-2.5099417|103.4796523 unknown
InChI: InChI=1S/C10H11BrO2/c11-7-6-10(12)13-8-9-4-2-1-3-5-9/h1-5H,6-8H2
charge 0 multiplicity 1
24 atoms
Br 5.725161 -1.638388 0.052047
O  0.704198 0.103081 -0.126565
O  2.299977 1.787343 0.133171
C  -1.70802 0.449714 -0.051202
C  -0.379754 1.158954 -0.098953
C  2.998232 -0.583504 -0.051203
C  -2.439162 0.209654 -1.241457
C  -2.246321 0.016196 1.187226
C  2.007269 0.575199 -0.000196
C  -3.685041 -0.455114 -1.197428
C  -3.489967 -0.650642 1.234783
C  4.430927 -0.080497 0.14505
C  -4.212461 -0.887167 0.04146
H  -0.260381 1.776376 -1.006478
H  -0.198433 1.795777 0.784635
H  2.723921 -1.323231 0.722164
H  2.888574 -1.100007 -1.022231
H  -2.030817 0.542326 -2.203555
H  -1.688315 0.200458 2.113283
H  4.748284 0.613961 -0.644857
H  4.589984 0.374376 1.132538
H  -4.24264 -0.634078 -2.123257
H  -3.897218 -0.981162 2.196599
H  -5.179497 -1.401127 0.077628
