program: Gaussian 09
title: 000252565
version: EM64L-G09RevD.01
frameworkgroup: C1[X(C9H15BrO2)]
method: RPBEPBE
basis: SDD
operation: Freq
keyword: #p
keyword: freq=noraman
keyword: PBEPBE/SDD
title: #p freq=noraman PBEPBE/SDD
converged: YES YES NO NO
title: Mulliken charges:
elementType: Br O O C C C C C C C C C H H H H H H H H H H H H H H H
charge: -0.027683 -0.275582 -0.249161 0.041097 -0.431212 -0.446058 -0.399874 -0.396526 -0.388509 0.260968 -0.467555 -0.654135 0.232894 0.202980 0.234490 0.214430 0.208509 0.208063 0.200978 0.198167 0.208296 0.205378 0.192212 0.269923 0.269456 0.294961 0.293493
chargesum: 0.00000
title: Mulliken charges with hydrogens summed into heavy atoms:
elementType: Br O O C C C C C C C C C
charge: -0.027683 -0.275582 -0.249161 0.273991 0.006258 -0.023119 0.009167 0.009937 0.009082 0.260968 0.071824 -0.065681
polarizability: 1.62939792e+02 -3.90435272e+00 9.70570200e+01 -4.76628535e+00 5.05467162e+00 8.75365853e+01
1716.lowfreq: -7.1393 -0.0002 0.0004 0.0008 3.0960 11.0138 26.8593 35.9050 53.4314
frequency: 26.2896 35.8707 53.4227 56.3987 100.8016 119.3332 165.6544 212.4883 225.2708 289.6132 323.6012 334.9993 429.3324 440.5247 458.6243 530.0168 556.7566 599.7819 697.2396 762.8695 785.7519 789.3276 836.2263 872.9047 880.1125 894.8312 921.1890 931.2523 962.3155 997.0065 1044.7969 1053.5510 1074.6303 1083.6417 1109.6567 1124.0507 1138.4489 1152.1435 1199.2435 1229.5954 1241.6588 1253.6318 1260.3875 1261.9468 1301.0566 1309.2967 1325.0770 1330.9813 1339.5849 1339.9018 1350.1856 1363.2781 1445.3085 1454.3268 1461.7754 1463.8856 1465.2465 1471.9155 1479.8863 1622.5190 2971.1430 2972.5264 2975.7188 2986.2501 2990.8487 3011.4224 3018.3357 3036.6145 3038.1992 3046.5486 3056.7219 3064.9792 3071.8536 3078.9472 3164.4055
redmass: 2.5421 3.4333 5.7992 4.9716 3.3843 4.7037 5.9612 1.9439 3.8425 4.9169 1.8327 4.7177 2.9950 2.9694 2.1233 2.6806 2.8977 4.3829 5.6768 1.2578 1.5152 2.1615 2.5603 3.2122 1.9475 1.6352 1.9326 3.3232 1.4724 2.7118 1.8104 1.1073 3.8598 1.3207 2.6799 1.2262 2.7843 2.3245 1.4945 1.2833 1.3127 1.2741 1.2858 1.1631 1.1883 1.3188 1.5816 1.3585 1.5390 1.4719 1.5589 1.5083 1.0937 1.1005 1.0859 1.0904 1.0896 1.0834 1.0980 9.5858 1.0669 1.0609 1.0630 1.0621 1.0634 1.0831 1.0611 1.0954 1.0981 1.1010 1.1023 1.1028 1.1001 1.0570 1.1111
irintensity: 0.0759 0.0642 1.4717 0.0836 4.7003 2.6924 0.7951 1.5360 10.2807 0.9825 1.6418 9.6670 2.6903 3.2361 0.2132 11.6395 3.0299 41.4478 16.4112 15.0651 1.4259 4.2939 16.3978 6.8268 1.6873 17.2316 14.1254 45.9512 0.1031 72.4588 0.8156 0.1501 34.2452 3.7856 3.6457 6.8180 364.0848 2.4069 0.3927 39.6708 0.7294 2.6534 3.2476 0.9062 1.9462 0.7192 137.2907 1.3443 13.7341 2.1953 1.9912 0.6122 27.7399 8.4344 1.2031 14.5958 6.7468 21.6610 3.6113 167.7883 29.6476 36.0328 32.8871 10.2327 18.0490 19.8150 8.5908 59.8054 61.8441 38.2621 17.0318 73.1075 2.7888 7.7993 4.9762
temp: 298.150 k
press: 1.00000 atm
elementType: 35 8 8 6 6 6 6 6 6 6 6 6 1 1 1 1 1 1 1 1 1 1 1 1 1 1 1
symmnumber: 1
zpe: 595297.3 jmol-1
zpe.correction: 0.226737 hartree
zpe.thermalcorrener: 0.239840 hartree
zpe.thermalcorrenthalpy: 0.240784 hartree
zpe.thermalcorrgfe: 0.183806 hartree
zpe.sumelectzpe: -514.922619 hartree
zpe.sumelectthermal: -514.909516 hartree
zpe.sumelectthermalent: -514.908572 hartree
zpe.sumelectthermalfe: -514.965550 hartree
dipole: -3.6316 -0.6948 -0.4881
dipole: 3.7295
quadrupole: -83.6346 -84.0237 -82.6508
quadrupole: 1.0563 1.0608 -3.2083
quadrupole: -0.1982 -0.5873 0.7856 1.0563 1.0608 -3.2083
hfenergy: -515.1493561 hartree
pointgroup: C01[X(C9H15Br1O2)]
dipole: -1.4466288 0.1037034 0.2225562 debye
polarizability: 161.8534194|7.7887654|94.8374046|6.6169258|7.3206579|90.8425733 unknown
InChI: InChI=1S/C9H15BrO2/c10-7-6-9(11)12-8-4-2-1-3-5-8/h8H,1-7H2
charge 0 multiplicity 1
27 atoms
Br 5.620516 0.556857 0.49468
O  0.306217 0.517505 0.38205
O  1.319795 -0.805153 -1.258552
C  -1.063761 0.124981 -0.115029
C  -1.477381 -1.215858 0.516393
C  -2.007149 1.269962 0.27344
C  -2.932354 -1.5662 0.112722
C  -3.463725 0.919697 -0.126339
C  -3.910681 -0.428102 0.490636
C  1.400721 -0.028374 -0.276252
C  2.698575 0.456752 0.362714
C  3.913903 -0.091021 -0.390024
H  -0.996024 0.015807 -1.215198
H  -1.406957 -1.12528 1.618551
H  -0.782957 -2.013166 0.195456
H  -1.681144 2.207817 -0.212906
H  -1.946455 1.427091 1.368167
H  -3.232673 -2.513128 0.599492
H  -2.977909 -1.742115 -0.981704
H  -3.538897 0.857821 -1.231636
H  -4.140178 1.734636 0.1933
H  -4.935169 -0.678686 0.155155
H  -3.947876 -0.330234 1.595189
H  2.700696 1.561514 0.374136
H  2.712612 0.138745 1.421271
H  3.968433 -1.187974 -0.366299
H  3.967624 0.266508 -1.427509
