program: Gaussian 09
title: 000252563
version: EM64L-G09RevD.01
frameworkgroup: C1[X(C9H11ClO)]
method: RPBEPBE
basis: SDD
operation: Freq
keyword: #p
keyword: freq=noraman
keyword: PBEPBE/SDD
title: #p freq=noraman PBEPBE/SDD
converged: NO YES NO NO
title: Mulliken charges:
elementType: Cl O C C C C C C C C C H H H H H H H H H H H
charge: -0.061158 -0.269841 0.487778 -0.414357 -0.372007 -0.371856 -0.198867 -0.214125 -0.214144 -0.095100 -0.675918 0.191307 0.191294 0.238299 0.238312 0.184871 0.184882 0.254574 0.254573 0.201618 0.229931 0.229935
chargesum: 0.00000
title: Mulliken charges with hydrogens summed into heavy atoms:
elementType: Cl O C C C C C C C C C
charge: -0.061158 -0.269841 0.487778 -0.031756 -0.133709 -0.133544 0.170886 0.040448 0.040428 -0.095100 -0.014434
polarizability: 1.63367991e+02 -1.74056724e-02 9.94721356e+01 1.29283300e+01 3.66065016e-02 6.67578255e+01
1716.lowfreq: -16.1176 -5.5031 0.0019 0.0023 0.0029 0.8001 16.2986 50.9116 71.6062
frequency: -15.3526 50.8408 71.2930 106.5056 141.1413 227.9917 239.7187 241.2326 300.0802 353.6409 406.9458 411.2074 420.6009 521.8624 626.6146 644.7644 712.0882 806.5708 811.2195 817.1382 829.2071 869.8488 948.8942 964.5568 972.6071 979.2034 1002.0327 1053.4932 1071.1224 1110.1591 1115.3919 1135.2496 1182.7667 1194.2074 1227.2770 1248.2848 1294.6532 1331.4597 1381.1379 1388.3632 1393.4943 1402.2948 1458.1453 1475.4693 1480.0285 1483.1189 1492.6184 1589.3536 1605.0415 2910.3009 2922.0106 2958.1580 2965.5067 2994.4692 3091.4415 3103.1083 3134.8487 3136.7768 3168.0813 3171.3390
redmass: 3.6332 5.9952 1.7580 3.8883 5.3467 1.7741 5.0509 1.8962 5.5684 2.6986 2.8694 6.0084 3.7097 3.0443 6.8955 5.2767 3.8595 2.2203 2.7459 1.0861 1.2460 2.4041 1.4304 1.3766 3.9103 1.5772 4.1466 4.0166 2.7827 1.3164 2.1663 1.4068 1.1178 1.1088 2.6199 1.1530 1.2647 1.2281 7.7726 1.2566 2.7720 1.3968 1.0408 1.0800 2.5741 1.0744 1.0777 7.4198 6.4185 1.0552 1.0549 1.1062 1.1067 1.0360 1.0989 1.1010 1.0898 1.0897 1.0953 1.0965
irintensity: 0.1781 0.1439 2.9159 5.1744 0.4558 0.1787 0.0977 0.6104 1.6168 0.2664 0.0071 19.6511 2.5640 21.4566 0.0638 8.8030 1.4826 51.3768 30.9337 4.1898 0.0000 31.4800 8.4953 0.0130 50.8687 1.0324 35.1007 147.9133 35.7286 10.2831 16.6641 3.7647 0.1067 4.4794 7.6281 0.1679 0.1250 59.3405 0.4824 14.0889 5.5064 12.6604 11.3060 7.5375 53.4016 4.1079 4.9472 1.7194 24.7026 32.4193 132.4561 82.5735 27.0714 26.0294 37.3827 34.4970 9.5604 8.8968 8.7028 0.1774
temp: 298.150 k
press: 1.00000 atm
elementType: 17 8 6 6 6 6 6 6 6 6 6 1 1 1 1 1 1 1 1 1 1 1
symmnumber: 1
zpe: 461441.4 jmol-1
zpe.correction: 0.175754 hartree
zpe.thermalcorrener: 0.186215 hartree
zpe.thermalcorrenthalpy: 0.187159 hartree
zpe.thermalcorrgfe: 0.138574 hartree
zpe.sumelectzpe: -883.994625 hartree
zpe.sumelectthermal: -883.984164 hartree
zpe.sumelectthermalent: -883.983220 hartree
zpe.sumelectthermalfe: -884.031805 hartree
dipole: -2.9195 0.0033 -1.8458
dipole: 3.4540
quadrupole: -71.2775 -65.3048 -74.8283
quadrupole: -0.0031 2.9945 0.0120
quadrupole: -0.8073 5.1654 -4.3581 -0.0031 2.9945 0.0120
hfenergy: -884.1703787 hartree
pointgroup: C01 [X(C9H11Cl1O1)]
dipole: -1.1181745 0.0008891 -0.7722412 debye
dipolederiv: -0.8404623 0.0002846 -0.2167195 0.0003129 -0.1330937 0.0000507 -0.2401198 0.0000536 -0.1434275 -1.3137405 -0.0002309 0.1511104 -0.000321 -0.3884853 0.0000879 0.2405616 0.0001075 -0.4645552 0.0074494 -0.0000232 0.0290474 0.0000857 -0.0705949 0.0000705 -0.054832 0.0000508 -0.0944196 0.8046496 0.0000692 -0.067648 0.000276 0.3932679 -0.0001938 -0.2943138 -0.0002009 0.5372523 0.0393541 -0.0611208 0.0491674 0.0319675 0.0810265 0.0016665 0.0355076 0.0022346 -0.1277807 0.0393986 0.0610748 0.0492413 -0.0319673 0.0810001 -0.0013865 0.0353322 -0.0019344 -0.1277813 0.9678376 0.0000964 -0.0321398 -0.0001246 0.4412298 0.0002012 0.1658887 0.0001999 0.2816641 -0.3447772 0.0849293 -0.0611911 0.0947608 -0.0096583 0.0190345 -0.0637841 0.0285855 -0.1248541 -0.3448146 -0.0847171 -0.0613148 -0.0945016 -0.0094995 -0.0188393 -0.063901 -0.0284189 -0.1249199 1.1773881 -0.0004615 0.3702014 -0.0005044 0.1387015 -0.0000185 0.3912044 -0.0000122 0.0516131 -0.107922 -0.0001018 0.0896346 -0.0000848 0.0513999 0.0001099 0.0726074 0.0001083 -0.0534338 -0.0541736 0.0386562 -0.0328696 0.0429386 -0.1119539 0.1644878 0.0690382 0.0742228 -0.0700013 -0.0542746 -0.038613 -0.0330585 -0.0431206 -0.1113356 -0.1645965 0.068937 -0.0743056 -0.0706025 0.0381362 0.0922084 -0.044896 0.0812863 -0.0351357 0.02118 -0.0427116 0.0270376 0.1324685 0.0380955 -0.0921498 -0.0450392 -0.0812611 -0.0349823 -0.0213984 -0.0428386 -0.0272577 0.1323907 -0.0894068 0.007691 0.0092563 0.0905956 -0.1255983 0.1453653 -0.0933866 0.1288581 -0.0642126 -0.0893977 -0.0077134 0.0092773 -0.0903756 -0.1250244 -0.1455011 -0.0935459 -0.1290104 -0.0648038 0.0547859 -0.0690556 -0.0321714 -0.0655761 -0.0071907 -0.0182766 -0.0372426 -0.0204948 0.156018 0.0548432 0.0690705 -0.0320663 0.065601 -0.0073002 0.0180619 -0.0371305 0.0202794 0.1560668 -0.2088083 -0.0000023 -0.0195052 0.000003 0.1099671 0.0000447 -0.0282996 0.0000413 0.0687604 0.1129143 0.0585265 -0.0391022 0.0318405 -0.0635845 0.1165945 0.0065418 0.0906308 0.007497 0.112925 -0.0584175 -0.0392146 -0.0318309 -0.0631554 -0.1167446 0.0064873 -0.0907755 0.0070614 unknown
polarizability: 162.1592687|-0.0129394|99.4721694|16.8064196|0.0151935|67.9665138 unknown
InChI: InChI=1S/C9H11ClO/c1-2-11-7-8-3-5-9(10)6-4-8/h3-6H,2,7H2,1H3
charge 0 multiplicity 1
22 atoms
Cl 4.386732 -0.001117 0.812566
O  -2.336301 -0.000198 0.186462
C  -0.039722 0.000807 -0.589899
C  -1.488542 0.00139 -1.022285
C  0.6493 1.219551 -0.3712
C  0.648782 -1.218542 -0.372912
C  -3.769898 0.000038 -0.155224
C  1.994957 1.230871 0.056837
C  1.994426 -1.231046 0.055115
C  2.647128 -0.000369 0.263061
C  -4.552129 -0.00141 1.157799
H  -1.717981 0.902279 -1.634446
H  -1.718019 -0.897886 -1.6368
H  0.130177 2.172206 -0.527549
H  0.129243 -2.170746 -0.530612
H  -4.011858 0.900439 -0.76471
H  -4.011702 -0.899103 -0.766626
H  2.52426 2.173253 0.225726
H  2.523323 -2.173894 0.222681
H  -5.639771 -0.001272 0.959767
H  -4.302599 -0.896036 1.753731
H  -4.302706 0.891983 1.755616
