program: Gaussian 09
title: 000260846
version: EM64L-G09RevD.01
frameworkgroup: C1[X(C13H22N6O2)]
method: RPBEPBE
basis: SDD
operation: Freq
keyword: #p
keyword: freq=noraman
keyword: PBEPBE/SDD
title: #p freq=noraman PBEPBE/SDD
converged: YES YES NO NO
title: Mulliken charges:
elementType: O O N N N N N N C C C C C C C C C C C C C H H H H H H H H H H H H H H H H H H H H H H
charge: -0.245496 -0.254235 -0.098110 -0.098721 -0.372908 -0.428956 -0.040547 -0.625542 -0.456955 -0.363958 -0.320814 -0.442133 -0.343785 -0.336308 -0.401997 0.083999 -0.323169 -0.318827 0.219843 -0.040935 0.137526 0.224504 0.231209 0.196533 0.201654 0.211307 0.194772 0.265091 0.210108 0.195617 0.217489 0.206909 0.190285 0.220867 0.227639 0.217356 0.189925 0.189949 0.213328 0.300292 0.309569 0.351180 0.306445
chargesum: 0.00000
title: Mulliken charges with hydrogens summed into heavy atoms:
elementType: O O N N N N N N C C C C C C C C C C C C C
charge: -0.245496 -0.254235 -0.098110 -0.098721 -0.072617 -0.119387 -0.040547 0.032083 -0.001242 0.034229 0.085265 0.033066 0.069322 0.060886 0.046510 0.083999 0.084112 0.084450 0.219843 -0.040935 0.137526
polarizability: 2.49412696e+02 -1.59671966e+00 1.89521063e+02 -2.33678142e+00 8.84477007e+00 1.30032896e+02
1716.lowfreq: -9.7025 -3.2149 0.0004 0.0006 0.0007 6.3597 21.7588 22.8529 39.4960
frequency: 19.6462 22.8379 39.2807 49.7407 71.5466 100.4549 118.6072 137.0750 178.9000 184.8994 218.1741 220.7581 242.7278 250.2977 264.0643 271.4690 300.8556 315.4122 325.8333 355.0862 368.6633 382.5143 400.6103 430.3970 469.0940 474.6437 506.4445 516.6004 524.3907 533.8369 548.7611 581.7259 584.1394 611.1909 657.1738 675.5882 695.8827 729.6038 749.5864 785.2036 806.4063 820.3133 839.3200 841.1830 886.3711 907.2829 940.8048 944.2314 977.5555 984.7805 1024.0548 1026.9345 1028.9337 1051.3847 1056.6193 1073.9951 1076.1769 1096.0457 1099.6611 1116.1845 1127.6493 1139.3282 1155.2971 1171.7265 1189.4889 1191.9513 1210.2735 1217.6022 1237.2543 1240.8918 1260.0014 1266.3923 1278.8456 1283.1818 1292.0129 1300.8199 1320.1745 1328.3055 1339.1967 1342.0111 1359.0409 1365.6553 1370.6838 1384.5209 1386.2639 1397.4035 1439.2098 1442.4690 1446.5730 1449.6234 1455.4982 1457.5684 1459.7680 1463.7265 1473.8165 1475.2048 1482.9891 1561.9817 1586.5410 1630.4695 1677.4098 2841.2774 2851.1819 2856.6122 2868.4575 2880.0848 2891.3337 2950.2836 2954.9123 2992.1170 3001.2083 3003.5921 3021.6385 3038.4690 3039.1128 3054.8854 3065.3965 3079.6126 3084.6701 3469.0385 3529.5500 3546.6968 3698.2748
redmass: 4.8862 5.3091 3.4176 5.2840 3.5869 4.2187 3.4997 4.2035 3.1342 6.9782 3.1550 2.4798 1.9575 1.8717 1.9121 1.8266 3.5171 2.4334 2.7722 2.1465 3.6845 3.1070 2.1745 5.3457 2.8140 3.4609 2.3840 2.4215 1.3519 7.0877 1.2762 3.5293 2.1747 6.1580 4.2548 3.8734 5.1321 2.3481 7.7325 2.1209 3.9960 2.4437 3.0404 1.7551 1.9558 2.2719 3.9588 2.3094 1.8851 2.0337 2.4422 2.1997 2.2845 2.3630 2.2417 2.5607 3.3175 2.8884 2.2278 2.5385 2.8620 2.7955 3.3678 2.4736 1.0658 1.2319 1.3925 2.6772 2.7160 1.3161 1.3845 1.2955 1.5580 1.5411 1.2884 1.2656 1.2649 1.2974 1.4725 1.2545 1.4409 1.4617 1.2722 1.4884 1.8475 1.4050 2.5077 1.0828 1.0814 1.0959 2.0798 1.0938 1.1028 1.1718 1.1990 1.1665 1.1296 7.4741 1.7265 2.2162 7.0737 1.0706 1.0716 1.0706 1.0688 1.0694 1.0697 1.0669 1.0668 1.0672 1.0897 1.0811 1.0893 1.0887 1.0872 1.1006 1.0918 1.0962 1.0971 1.0754 1.0769 1.0458 1.1046
irintensity: 0.8131 4.1016 0.6685 3.1981 1.1241 0.4702 5.7645 1.4725 5.9128 4.7165 4.5532 1.7206 2.2444 17.3246 14.4118 80.4220 2.1815 22.7144 9.5403 11.0327 3.8005 1.6418 1.4600 4.6578 3.1372 46.0971 113.9892 137.7522 177.0399 5.3395 75.7452 11.8634 10.9050 18.9484 4.0507 23.5599 25.9157 13.8462 20.6717 1.0155 17.0830 1.8110 27.1583 4.2611 6.0868 13.8315 13.9063 21.0404 7.1452 11.0953 6.3517 11.8743 11.7285 43.0651 27.7060 65.3923 32.5692 40.8301 31.9519 14.2933 6.8427 49.8985 34.7151 5.7795 2.1420 7.4831 0.7884 14.7660 9.9872 18.6635 22.8340 5.1405 17.3778 49.5471 12.9213 35.7101 4.6843 6.7191 10.8838 14.2049 3.7681 35.0040 2.3829 3.3569 14.6635 17.0789 16.3628 2.6787 0.9659 19.2338 160.5035 3.1666 4.6066 59.8580 26.8076 28.5690 55.2318 566.5529 35.0409 424.4226 265.4421 55.9352 45.0319 60.4182 184.8271 13.9125 154.4692 28.1039 105.4041 13.5385 0.8796 46.6314 50.2954 19.6397 32.7169 51.3350 36.8708 44.7727 33.6755 4.7370 22.3998 88.8173 39.5109
temp: 298.150 k
press: 1.00000 atm
elementType: 8 8 7 7 7 7 7 7 6 6 6 6 6 6 6 6 6 6 6 6 6 1 1 1 1 1 1 1 1 1 1 1 1 1 1 1 1 1 1 1 1 1 1
symmnumber: 1
zpe: 944387.0 jmol-1
zpe.correction: 0.359698 hartree
zpe.thermalcorrener: 0.379806 hartree
zpe.thermalcorrenthalpy: 0.380750 hartree
zpe.thermalcorrgfe: 0.309604 hartree
zpe.sumelectzpe: -985.879049 hartree
zpe.sumelectthermal: -985.858941 hartree
zpe.sumelectthermalent: -985.857997 hartree
zpe.sumelectthermalfe: -985.929143 hartree
dipole: 3.0844 -8.9795 -0.3164
dipole: 9.4997
quadrupole: -99.9638 -132.0987 -128.0411
quadrupole: -21.2365 -10.6726 -0.6260
quadrupole: 20.0707 -12.0641 -8.0066 -21.2365 -10.6726 -0.6260
hfenergy: -986.238747 hartree
pointgroup: C01 [X(C13H22N6O2)]
dipole: -1.1637272 -3.5148916 0.5099943 debye
polarizability: 249.353778|2.1706392|186.9570632|-2.5244246|-15.0992798|132.6558133 unknown
InChI: InChI=1S/C13H22N6O2/c14-13-16-11-10(12(20)17-13)8-19(9-15-11)3-1-2-18-4-6-21-7-5-18/h15-16H,1-9,14H2
charge 0 multiplicity 1
43 atoms
O  6.13117 1.21247 0.972952
O  -2.69921 2.54591 -0.626614
N  3.990446 -0.276276 -0.325184
N  -0.397933 -1.112152 -0.113614
N  -2.430475 -2.060931 0.853147
N  -4.519034 -0.9395 0.514653
N  -4.683497 1.343637 -0.234421
N  -6.623147 0.110964 0.230784
C  1.706306 -0.580687 -1.387141
C  3.225275 -0.837518 -1.46875
C  1.088005 -1.108655 -0.077345
C  -0.978472 0.257272 -0.21072
C  3.991958 1.210266 -0.297055
C  5.387614 -0.783956 -0.299462
C  -0.984647 -1.831519 1.045839
C  -2.476614 0.238832 0.004432
C  4.746905 1.714051 0.943951
C  6.118736 -0.259174 0.946213
C  -3.115892 -0.908485 0.422693
C  -3.260259 1.456108 -0.291045
C  -5.242999 0.207687 0.149546
H  1.219509 -1.093363 -2.239108
H  1.494682 0.498333 -1.508269
H  3.607927 -0.444957 -2.446946
H  3.402472 -1.931646 -1.472335
H  1.485307 -0.515361 0.782325
H  1.425681 -2.153486 0.073708
H  -0.775899 0.674647 -1.212621
H  -0.506711 0.961806 0.521668
H  4.47189 1.631114 -1.217225
H  2.951501 1.580918 -0.256782
H  5.366775 -1.890524 -0.275523
H  5.955382 -0.470011 -1.212731
H  -0.865545 -1.259031 1.997549
H  -0.481106 -2.805872 1.161455
H  4.8315 2.813187 0.937934
H  4.211301 1.385288 1.861066
H  5.617723 -0.645803 1.860283
H  7.178514 -0.563924 0.945586
H  -2.665351 -2.929572 0.358688
H  -4.950199 -1.690732 1.057585
H  -7.140445 0.954164 -0.0082
H  -7.112443 -0.778617 0.286232
