program: Gaussian 09
title: 000252538
version: EM64L-G09RevD.01
frameworkgroup: C1[X(C17H28ClNO2)]
method: RPBEPBE
basis: SDD
operation: Freq
keyword: #p
keyword: freq=noraman
keyword: PBEPBE/SDD
title: #p freq=noraman PBEPBE/SDD
converged: YES YES NO NO
title: Mulliken charges:
elementType: Cl O O N C C C C C C C C C C C C C C C C C H H H H H H H H H H H H H H H H H H H H H H H H H H H H
charge: -0.077162 -0.431586 -0.441092 -0.284794 0.117077 -0.405437 0.293349 0.572175 -0.718098 -0.777338 -0.728047 -0.723448 -0.718163 -0.646361 -0.419971 0.369666 -0.341410 0.235766 -0.575490 -0.365189 -0.327980 0.191795 0.191095 0.218066 0.224794 0.211221 0.215335 0.225255 0.215377 0.206788 0.211186 0.214551 0.204924 0.208378 0.228784 0.206525 0.224631 0.221173 0.237322 0.277800 0.214352 0.241887 0.287554 0.189065 0.214172 0.362857 0.209708 0.206913 0.332024
chargesum: 0.00000
title: Mulliken charges with hydrogens summed into heavy atoms:
elementType: Cl O O N C C C C C C C C C C C C C C C C C
charge: -0.077162 -0.068729 -0.109067 0.002760 0.117077 -0.022547 0.293349 0.572175 -0.064017 -0.121370 -0.095522 -0.081362 -0.065834 -0.409039 -0.142171 0.369666 -0.341410 0.235766 -0.119252 0.038049 0.088641
polarizability: 2.40338216e+02 -8.46511759e+00 2.12531434e+02 -2.57194107e+00 1.93611686e+01 1.76605146e+02
1716.lowfreq: -15.0125 -12.2014 -8.8193 0.0013 0.0015 0.0021 12.3431 17.9577 33.0108
frequency: 10.2146 17.3858 32.9684 42.2267 51.6982 69.9500 93.7252 113.2497 130.2865 138.7378 163.9943 175.7441 183.1598 198.1453 210.4002 225.9531 243.6432 244.3034 252.5321 268.8803 281.0465 281.3921 298.9261 316.0101 320.9504 325.3244 338.4588 345.7582 360.7663 387.4810 409.6467 413.7365 418.4702 437.9705 456.0467 458.2569 486.8593 505.7765 531.4790 544.3300 604.7015 658.6381 689.7835 701.1811 735.1900 741.0608 803.8682 813.1441 822.1107 862.8814 866.9373 885.2005 898.5604 916.1749 922.5545 927.9436 929.3307 935.6738 942.0028 953.4505 974.7408 1001.7024 1016.7539 1021.4115 1029.1857 1057.3245 1074.7248 1084.1910 1115.2043 1127.4780 1132.5422 1161.6849 1166.1666 1192.9897 1198.1927 1217.0755 1231.2056 1247.9211 1251.6089 1260.6380 1276.9719 1292.0535 1308.2679 1322.2996 1329.8363 1339.2617 1353.1554 1369.0673 1372.5566 1375.2767 1377.2621 1383.2401 1397.8690 1402.7957 1411.4143 1437.1065 1452.1082 1457.6301 1460.7558 1463.5622 1464.0054 1466.2609 1471.7892 1472.6604 1476.4032 1478.8890 1481.5273 1486.1540 1489.8493 1495.7053 1503.0870 1575.6244 1612.4365 2897.1895 2952.9978 2961.8197 2971.5588 2972.2942 2975.7556 2977.5056 2979.2964 2985.1432 2989.1651 3006.8521 3053.0329 3055.0829 3058.8722 3061.2974 3066.5505 3068.7091 3069.9166 3070.2025 3078.4384 3082.2850 3082.8026 3093.9681 3121.1886 3179.5844 3446.3988 3494.4624 3562.8303
redmass: 4.5864 4.6663 7.3605 2.7185 4.1631 1.6602 5.7992 4.3857 2.9235 4.4442 1.9197 2.8596 3.9592 1.8083 2.4924 3.0921 1.6673 1.4929 1.3962 2.3741 1.4770 1.4023 2.6947 1.1677 1.9284 2.3403 2.2087 3.1687 2.1798 2.8602 2.2098 3.0458 3.8704 3.8788 1.8312 1.4057 3.4532 3.0081 3.4805 3.2059 4.7933 2.5411 1.7841 5.1480 3.7936 3.9114 4.1973 1.1682 2.9436 1.9979 1.6173 1.7298 2.2768 1.8637 1.8350 1.6137 1.7926 1.2754 1.8132 4.0167 1.7547 1.3144 2.1023 1.5617 1.4157 1.9499 2.1296 1.9288 1.9807 2.4917 2.7424 1.4871 1.7123 2.1837 2.3458 3.2323 1.9086 3.0375 1.7119 2.1304 1.1992 1.3350 1.4029 1.6140 1.2332 1.3451 1.2534 1.2106 2.1457 1.6134 1.2072 1.3175 1.2432 1.2399 3.7838 1.1169 1.0696 1.0612 1.0492 1.1284 1.1004 1.1347 1.0615 1.0748 1.6532 1.1814 1.1800 1.0697 1.0917 1.0617 1.0564 6.5524 7.4415 1.0657 1.0587 1.0351 1.0366 1.0346 1.0855 1.0369 1.0371 1.0700 1.0601 1.0994 1.1028 1.0997 1.0993 1.0996 1.0991 1.0984 1.0997 1.1021 1.0998 1.0985 1.0988 1.0959 1.0899 1.0909 1.0741 1.0648 1.0662
irintensity: 0.2494 0.1000 0.1685 0.0040 0.2402 4.9224 1.3537 4.1288 1.5539 0.1913 1.4009 1.9422 0.5103 0.0733 0.0316 0.8160 0.0117 0.9747 0.2844 0.5202 0.6561 0.9225 5.9854 178.8652 7.0890 2.8333 0.8774 2.3230 0.0705 4.6616 7.1202 35.5800 5.1601 5.5565 42.7250 83.5759 3.5225 0.9134 5.9145 4.4640 5.1860 27.1611 166.8621 34.7980 13.6822 22.8431 3.8295 7.5140 40.0410 1.8703 19.1167 2.2199 12.2346 2.4679 5.6675 1.8705 3.2536 1.5508 4.0096 58.8342 10.4460 2.0516 23.6614 6.1454 0.1677 0.9286 14.0969 73.3339 29.6213 5.9903 82.2463 33.8991 20.2137 23.6612 20.0280 13.3592 11.3027 23.3659 38.3809 47.2396 1.4201 5.8268 10.5272 28.0200 4.5199 6.4513 10.0148 10.0960 17.3187 24.8003 19.1161 4.2962 19.1082 13.6819 7.9774 8.7482 3.7586 1.2320 1.4344 17.9464 13.0009 4.0523 9.2702 6.1860 61.0049 42.5690 9.5247 16.9720 7.0969 19.8981 19.5667 21.8959 0.4173 70.6566 26.6096 38.8978 44.6972 40.2171 33.4004 19.8655 22.5514 68.4779 43.7316 29.4596 14.0585 4.1108 48.6803 8.5980 21.0907 99.7901 70.0477 39.7431 35.9793 49.4018 22.4186 40.0504 14.5725 0.1328 3.0133 60.1787 6.0517
temp: 298.150 k
press: 1.00000 atm
elementType: 17 8 8 7 6 6 6 6 6 6 6 6 6 6 6 6 6 6 6 6 6 1 1 1 1 1 1 1 1 1 1 1 1 1 1 1 1 1 1 1 1 1 1 1 1 1 1 1 1
symmnumber: 1
zpe: 1096563.5 jmol-1
zpe.correction: 0.417659 hartree
zpe.thermalcorrener: 0.442477 hartree
zpe.thermalcorrenthalpy: 0.443422 hartree
zpe.thermalcorrgfe: 0.361856 hartree
zpe.sumelectzpe: -1328.179963 hartree
zpe.sumelectthermal: -1328.155145 hartree
zpe.sumelectthermalent: -1328.154200 hartree
zpe.sumelectthermalfe: -1328.235766 hartree
dipole: -2.4998 -0.3276 1.6577
dipole: 3.0173
quadrupole: -138.2237 -138.2091 -141.3079
quadrupole: -7.3208 0.5355 8.4980
quadrupole: 1.0232 1.0378 -2.0610 -7.3208 0.5355 8.4980
hfenergy: -1328.5976219 hartree
pointgroup: C01 [X(C17H28Cl1N1O2)]
dipole: -0.8679889 0.1843687 0.7885579 debye
polarizability: 232.0282294|-12.3008399|219.8170926|-4.3165162|22.1238849|177.629474 unknown
InChI: InChI=1S/C17H28ClNO2/c1-16(2,3)11-17(4,5)13-8-12(10-19-6-7-20)15(21)14(18)9-13/h8-9,19-21H,6-7,10-11H2,1-5H3
charge 0 multiplicity 1
49 atoms
Cl -0.391497 -3.924203 -1.863325
O  2.206998 -3.010019 -0.517751
O  4.135288 2.584037 -1.895756
N  3.597419 -0.422375 0.33778
C  -2.421367 0.139149 1.074217
C  -2.147284 1.685197 0.95224
C  -2.060304 2.446032 -0.419914
C  -1.208682 -0.707947 0.613662
C  -2.631656 -0.148232 2.599186
C  -3.728887 -0.275188 0.352606
C  -1.404185 3.823903 -0.106305
C  -3.465827 2.729385 -1.023839
C  -1.185032 1.718371 -1.472639
C  0.089428 -0.466282 1.14498
C  -1.345462 -1.778088 -0.304117
C  1.225354 -1.220876 0.785994
C  -0.218337 -2.533323 -0.665702
C  1.06815 -2.27714 -0.152196
C  2.622236 -0.915337 1.337329
C  3.245643 0.842355 -0.33783
C  4.455108 1.362114 -1.139612
H  -2.936282 2.191203 1.5489
H  -1.198718 1.884696 1.49153
H  -1.764914 0.184592 3.198517
H  -2.771503 -1.230219 2.776435
H  -3.527472 0.383989 2.970809
H  -4.015799 -1.310132 0.618722
H  -4.55473 0.388918 0.663812
H  -3.647207 -0.215931 -0.746553
H  -0.367373 3.695513 0.258884
H  -1.973931 4.371383 0.669245
H  -1.369226 4.456819 -1.012898
H  -4.115605 3.245937 -0.291371
H  -3.37011 3.384716 -1.910668
H  -3.980595 1.809531 -1.346254
H  -1.093192 2.341891 -2.382513
H  -0.166261 1.524313 -1.08967
H  -1.618502 0.747876 -1.770637
H  0.234476 0.344999 1.868607
H  -2.312615 -2.026707 -0.745635
H  2.533089 -0.161161 2.142456
H  3.049571 -1.831502 1.784226
H  3.831683 -1.16775 -0.332565
H  2.980932 1.583668 0.445894
H  2.368203 0.770197 -1.023889
H  1.95146 -3.734332 -1.149399
H  4.747991 0.633103 -1.915358
H  5.316519 1.511839 -0.457363
H  3.916202 3.30792 -1.256171
