program: Gaussian 09
title: 000252534
version: EM64L-G09RevD.01
frameworkgroup: C1[X(C25H23Cl3N4O5)]
method: RPBEPBE
basis: SDD
operation: Freq
keyword: #p
keyword: freq=noraman
keyword: PBEPBE/SDD
title: #p freq=noraman PBEPBE/SDD
converged: YES YES NO NO
title: Mulliken charges:
elementType: Cl Cl Cl O O O O O N N N N C C C C C C C C C C C C C C C C C C C C C C C C C H H H H H H H H H H H H H H H H H H H H H H H
charge: -0.069425 -0.050881 -0.056411 -0.287496 -0.377916 -0.302314 -0.288098 -0.253132 -0.196823 -0.516156 -0.461489 -0.479455 -0.368813 -0.457884 -0.283299 -0.235845 0.278451 0.493953 -0.290704 -0.478147 0.277665 0.292589 -0.082126 -0.181978 0.506752 0.496342 -0.275492 -0.423765 -0.302009 -0.392297 -0.436036 -0.056551 -0.082037 -0.188785 -0.194648 -0.270776 -0.266198 0.283591 0.209739 0.227490 0.252889 0.231233 0.234671 0.252634 0.264972 0.380304 0.332318 0.232856 0.232931 0.355719 0.358800 0.257741 0.265077 0.322938 0.308599 0.248842 0.245952 0.238183 0.262795 0.260960
chargesum: 0.00000
title: Mulliken charges with hydrogens summed into heavy atoms:
elementType: Cl Cl Cl O O O O O N N N N C C C C C C C C C C C C C C C C C C C C C C C C C
charge: -0.069425 -0.050881 -0.056411 -0.287496 -0.377916 -0.302314 -0.288098 -0.253132 -0.196823 -0.135853 -0.105770 -0.120655 0.124517 0.022495 0.182605 0.281761 0.278451 0.493953 0.041615 -0.245291 0.277665 0.292589 -0.082126 0.050954 0.506752 0.496342 -0.017751 -0.158688 0.020929 -0.083698 -0.187194 -0.056551 -0.082037 0.057166 0.043535 -0.007981 -0.005238
polarizability: 4.19399177e+02 1.02378256e+01 4.28203119e+02 -9.52757697e+00 -6.28275476e-01 1.97634249e+02
1716.lowfreq: -4.9010 -4.0001 0.0014 0.0015 0.0019 3.4803 7.3011 7.7464 15.2884
frequency: 6.2933 7.3036 15.2192 16.2502 22.1238 29.7563 35.0416 45.3501 50.9885 58.2047 65.4190 73.8666 84.8681 87.8898 105.0444 113.9273 128.1847 134.8132 145.5313 172.4871 183.1628 185.0644 185.3549 211.1828 216.8477 239.0104 241.9238 260.7959 263.5245 280.1918 289.5857 299.5503 301.1080 328.4023 350.8285 352.0793 364.9601 367.7567 373.7987 401.5825 402.9464 410.9363 429.1339 440.9820 441.6013 441.8811 487.1309 502.0964 562.8834 564.2797 569.5914 584.6564 592.3457 604.5808 627.0089 632.5607 651.6019 658.6714 668.3356 675.6714 678.8505 684.2372 685.3675 687.2706 690.9855 701.8070 712.2148 722.9397 753.5985 782.1276 786.5389 794.8091 796.3232 814.1492 837.2391 866.1090 871.3323 881.1140 886.6729 891.1718 895.1577 909.5787 916.1101 916.3645 930.9239 938.2156 964.8112 966.0274 969.1522 972.6455 978.6002 978.6959 980.8783 989.7245 1011.2894 1044.3722 1052.9291 1071.5910 1074.3219 1076.3736 1077.6094 1092.5756 1095.8655 1096.9925 1133.8635 1150.1354 1165.0748 1179.5040 1180.3668 1180.6849 1182.6314 1217.5474 1241.6145 1251.4077 1254.1862 1256.7715 1270.6848 1286.0642 1290.8318 1292.8971 1310.4002 1344.1720 1346.9996 1372.7974 1375.2950 1376.2229 1379.5538 1385.1947 1392.4445 1412.7643 1425.4115 1425.6912 1438.6034 1455.1364 1458.1646 1465.9587 1468.8860 1472.6901 1474.4437 1510.5328 1518.8444 1540.0219 1584.4567 1590.0893 1590.5366 1609.9399 1611.6538 1613.9129 1635.2215 1657.9167 1681.5298 2987.1449 2991.9954 3019.9295 3025.5384 3047.9331 3076.0100 3099.6526 3102.6836 3121.2032 3131.4272 3146.6492 3150.9194 3154.2171 3155.5336 3177.6660 3181.0150 3181.5397 3193.6002 3193.7727 3196.7395 3355.1641 3516.0359 3525.1361
redmass: 12.2796 10.2705 12.2080 8.0486 6.9147 6.5723 8.3600 6.4532 9.1214 8.8610 7.0840 6.5658 7.7737 7.4318 6.2985 7.9838 7.2189 9.2941 7.0844 3.8569 5.3515 5.1959 5.0370 6.8380 6.5637 4.8610 3.9469 4.4047 4.9826 7.0751 6.6549 5.7009 4.2363 4.3168 4.0439 4.9654 6.4358 6.7160 7.7304 7.9703 6.4816 8.5078 2.8331 3.1312 3.1302 3.1828 2.2529 2.6020 4.2496 4.4307 5.0210 5.5968 5.8986 6.2802 3.6952 1.3876 3.5694 2.4028 5.4868 6.4049 6.1496 2.2674 2.6200 2.3477 3.9271 4.8957 4.7784 3.1105 1.6011 1.5076 1.7843 1.3386 2.3062 3.4330 4.5533 4.4353 1.6069 1.5237 1.6048 3.7163 3.3988 1.3625 1.3910 1.3873 2.7562 3.5347 1.4017 3.2165 1.3355 2.9041 5.5512 5.7050 5.8433 1.3110 4.6070 4.4702 2.3817 2.0536 2.0566 2.1849 2.4408 1.5770 1.5707 1.5587 2.9264 3.2738 3.5038 1.1142 1.8439 1.1574 1.0889 1.6695 1.2056 1.5508 1.7623 1.6960 1.9121 1.4868 1.3084 1.7849 1.5271 1.4315 1.2879 1.6094 3.5848 2.2180 1.5117 3.4785 2.3827 3.1538 2.9809 3.0226 1.0884 1.0972 1.1036 1.1241 2.3520 2.7339 2.5627 2.1779 2.2690 3.0355 4.9193 4.8628 7.0321 6.3063 6.5737 6.1720 2.1052 6.2288 9.0703 1.0604 1.0639 1.0597 1.0595 1.1005 1.0982 1.1080 1.1071 1.0886 1.0890 1.0888 1.0929 1.0929 1.0931 1.0951 1.0969 1.0974 1.0935 1.0955 1.0932 1.0799 1.0768 1.0765
irintensity: 1.4260 0.2527 0.0088 0.6910 0.8009 0.5320 0.3240 1.1318 2.9371 3.0741 0.3737 3.3862 1.3036 2.1572 3.5912 8.9639 0.6417 1.8046 1.0517 2.3723 0.9663 0.6360 3.1872 2.9073 0.7997 0.7500 7.1945 2.5850 9.2006 9.0336 0.7019 9.8745 7.9320 18.0050 7.8302 10.7045 3.3732 6.0656 12.9809 1.7597 4.6627 4.5076 10.7451 2.6201 17.5800 8.6793 10.3150 2.9416 12.8964 0.3534 1.6720 5.7164 0.2951 6.7675 9.0662 49.3624 11.3181 38.6939 62.8002 47.9919 16.0131 36.2842 39.2520 21.1177 19.2311 0.4490 57.7160 95.3903 18.0849 185.6924 25.9257 32.2554 31.7888 8.0648 40.4236 25.9085 51.2401 3.9089 13.0838 101.0585 27.1799 4.9684 10.3189 44.1634 12.5754 8.7124 0.6102 39.1970 0.3947 106.6809 1.6065 9.6463 3.3332 3.8055 50.6844 261.9957 10.0867 18.7033 31.2268 27.3113 5.1952 5.7099 12.2757 24.9627 41.5724 307.3112 364.0619 2.9068 13.9090 5.5415 0.3721 185.8656 19.7328 8.7884 10.6264 37.2350 135.4744 8.1599 14.0249 13.4302 17.5979 68.1014 8.9473 24.5965 31.2581 13.6026 45.1816 23.9963 114.4779 65.0414 27.3513 110.5020 24.3521 44.5538 46.9934 30.3551 25.8872 58.1150 116.1608 273.2717 408.4157 339.9914 152.9159 41.9492 193.2676 57.1696 126.3855 234.5403 71.8508 253.9470 322.1041 20.7651 63.4679 15.3227 69.3065 23.3190 3.5496 7.7609 13.0174 11.8597 9.6091 7.5461 12.1555 1.7810 7.7106 1.8567 2.8680 2.5674 9.3085 4.5047 13.2621 404.0721 61.6181 37.8488
temp: 298.150 k
press: 1.00000 atm
elementType: 17 17 17 8 8 8 8 8 7 7 7 7 6 6 6 6 6 6 6 6 6 6 6 6 6 6 6 6 6 6 6 6 6 6 6 6 6 1 1 1 1 1 1 1 1 1 1 1 1 1 1 1 1 1 1 1 1 1 1 1
symmnumber: 1
zpe: 1170911.4 jmol-1
zpe.correction: 0.445977 hartree
zpe.thermalcorrener: 0.480800 hartree
zpe.thermalcorrenthalpy: 0.481744 hartree
zpe.thermalcorrgfe: 0.371723 hartree
zpe.sumelectzpe: -2939.165180 hartree
zpe.sumelectthermal: -2939.130357 hartree
zpe.sumelectthermalent: -2939.129412 hartree
zpe.sumelectthermalfe: -2939.239434 hartree
dipole: 0.5912 -2.9250 0.5740
dipole: 3.0389
quadrupole: -268.1620 -214.1653 -243.4574
quadrupole: 34.3937 -1.6174 3.5772
quadrupole: -26.2337 27.7629 -1.5292 34.3937 -1.6174 3.5772
hfenergy: -2939.6111564 hartree
pointgroup: C01 [X(C25H23Cl3N4O5)]
dipole: -0.3133137 -1.0350472 -0.50985 debye
polarizability: 397.7977439|64.0240421|324.9372931|-52.2959491|92.7427665|322.5015077 unknown
InChI: InChI=1S/C25H23Cl3N4O5/c26-17-4-1-7-20(14-17)29-23(33)32(10-12-36-24(34)30-21-8-2-5-18(27)15-21)11-13-37-25(35)31-22-9-3-6-19(28)16-22/h1-9,14-16,29-31H,10-13H2
charge 0 multiplicity 1
60 atoms
Cl -3.054636 5.124452 2.663745
Cl 2.256189 1.722564 4.557942
Cl 5.256667 -0.593468 -5.364795
O  -2.958381 -2.711951 1.832156
O  -0.808683 -0.986468 -1.832757
O  -4.028531 0.373504 1.216889
O  -1.009254 -3.207342 0.595523
O  0.550348 -1.635179 -3.648374
N  -3.632137 -1.123772 -0.551794
N  -2.379946 0.874645 -0.394543
N  -1.06362 -1.613111 2.352402
N  1.367748 -0.36458 -1.817793
C  -4.55388 -2.088999 0.079661
C  -3.236214 -1.323713 -1.964673
C  -3.833767 -3.263665 0.775136
C  -1.863282 -1.963981 -2.227293
C  -3.387004 0.076757 0.159776
C  -2.004217 2.18212 0.005102
C  -2.664051 2.906124 1.0360
C  -0.907481 2.778384 -0.681632
C  -1.600049 -2.56209 1.499641
C  0.419656 -1.05602 -2.546552
C  -2.202026 4.197941 1.338321
C  -0.475671 4.074976 -0.341413
C  0.285567 -1.182382 2.426187
C  2.699594 -0.051675 -2.211013
C  -1.119338 4.811422 0.68094
C  0.573948 -0.104603 3.307979
C  3.237908 -0.453777 -3.4614
C  1.330372 -1.779998 1.668761
C  3.489319 0.698151 -1.298375
C  1.899409 0.344637 3.41946
C  4.560731 -0.08195 -3.758109
C  2.648511 -1.29514 1.811046
C  4.811488 1.046553 -1.637076
C  2.957521 -0.227999 2.686344
C  5.370084 0.66111 -2.878118
H  -5.138174 -1.5350 0.833846
H  -5.252492 -2.493043 -0.679333
H  -3.987923 -1.99098 -2.428439
H  -3.293057 -0.358238 -2.503655
H  -3.225029 -3.872028 0.082701
H  -4.562667 -3.906425 1.295898
H  -1.741261 -2.187697 -3.3026
H  -1.697699 -2.869057 -1.620047
H  -1.738583 0.411158 -1.055613
H  -3.497876 2.451657 1.572439
H  -0.409421 2.233271 -1.493128
H  0.366177 4.523839 -0.87919
H  -1.752468 -1.137751 2.942599
H  1.087971 -0.095728 -0.869873
H  -0.792443 5.818562 0.951368
H  -0.221568 0.374189 3.888466
H  2.639238 -1.037304 -4.162894
H  1.105142 -2.611238 0.998252
H  3.069117 1.006326 -0.333768
H  3.454061 -1.761248 1.233484
H  5.415088 1.627393 -0.932161
H  3.981498 0.136883 2.801755
H  6.394378 0.929582 -3.148712
