program: Gaussian 09
title: 000252527
version: EM64L-G09RevD.01
frameworkgroup: C1[X(C12H12O2)]
method: RPBEPBE
basis: SDD
operation: Freq
keyword: #pfreq=noraman
keyword: PBEPBE/SDD
title: #p freq=noraman PBEPBE/SDD
converged: NO NO NO NO
title: Mulliken charges:
elementType: O O C C C C C C C C C C C C H H H H H H H H H H H H
charge: -0.275056 -0.275056 0.226037 0.226037 0.199847 0.199847 -0.411481 -0.411481 -0.393338 -0.393338 -0.228124 -0.228124 -0.533135 -0.533136 0.270255 0.270255 0.237014 0.237014 0.221583 0.221583 0.242526 0.221936 0.221937 0.221937 0.221936 0.242525
chargesum: 0.00000
title: Mulliken charges with hydrogens summed into heavy atoms:
elementType: O O C C C C C C C C C C C C
charge: -0.275056 -0.275056 0.226037 0.226037 0.199847 0.199847 -0.141226 -0.141226 -0.156324 -0.156324 -0.006541 -0.006541 0.153263 0.153262
polarizability: 2.01003297e+02 8.19815050e+00 1.59944109e+02 -4.22239056e-03 4.31717929e-03 6.41155483e+01
1716.lowfreq: -10.5743 -0.0007 -0.0004 0.0005 9.5895 15.2094 62.6740 103.3199 122.9523
frequency: 62.6740 103.3124 122.9523 162.0720 185.3143 202.2009 239.4397 245.0152 271.1551 302.6827 320.2605 338.4171 461.7685 470.3307 503.2290 515.0172 527.2026 580.8716 594.5727 655.4270 676.7168 738.6427 769.8851 789.3473 826.5060 831.3300 841.4533 880.9048 882.0389 969.3632 972.8007 976.9712 1032.9399 1065.7924 1078.7692 1113.7264 1113.8478 1148.1870 1151.3309 1155.3428 1186.4205 1192.0894 1229.0135 1238.0043 1249.0371 1369.4724 1406.2453 1411.3146 1430.0626 1434.0285 1442.8948 1458.5521 1467.3594 1467.3697 1472.6922 1475.9858 1515.2499 1588.4554 1590.3719 1628.8568 2957.7344 2958.1934 3045.8691 3045.9397 3124.2236 3124.2318 3131.8934 3132.2120 3159.1373 3159.2988 3180.1853 3180.6434
redmass: 3.3921 3.3668 4.1011 3.7569 3.3459 2.1259 3.5924 1.3181 1.4113 2.7593 4.5914 3.6568 6.4733 3.3246 6.5739 4.7787 6.4379 4.2862 3.2927 5.3863 4.5693 1.4245 5.7368 1.2620 3.5653 5.9983 4.7137 1.4657 1.4190 8.5688 1.3143 1.3115 7.6157 2.2715 1.8100 1.2605 1.2603 2.1361 1.2656 1.3853 1.2238 1.4936 2.6378 1.9942 2.3486 3.0151 2.1688 2.5010 3.1849 1.6813 1.3418 2.1102 1.0500 1.0501 1.0709 1.0936 4.0930 7.5954 5.5712 7.2650 1.0328 1.0329 1.1039 1.1039 1.0993 1.0992 1.0873 1.0876 1.0924 1.0929 1.0961 1.0959
irintensity: 4.7953 0.0000 14.6323 6.2003 0.1164 0.0000 0.0000 0.6262 0.0000 0.5414 0.0000 3.0128 0.0000 0.0000 7.0120 0.0000 0.0000 21.8824 4.6886 0.0000 0.7628 0.0000 9.1851 169.2139 0.0000 13.9176 0.0000 0.0005 0.0000 0.0000 0.0000 4.3637 219.2002 30.5980 0.0000 0.0000 0.3082 0.0000 0.0000 10.9640 21.0642 0.0000 0.0000 50.6076 196.2656 48.1211 0.0000 129.2695 0.0000 0.0000 33.0499 0.0000 0.0351 26.3600 87.8231 0.0000 126.2141 0.0000 61.5955 0.0000 149.9177 0.0007 0.0233 95.4498 48.3858 2.8907 21.9780 0.0000 0.0015 35.2737 20.0268 0.0008
temp: 298.150 k
press: 1.00000 atm
elementType: 8 8 6 6 6 6 6 6 6 6 6 6 6 6 1 1 1 1 1 1 1 1 1 1 1 1
symmnumber: 1
zpe: 546291.8 jmol-1
zpe.correction: 0.208072 hartree
zpe.thermalcorrener: 0.220337 hartree
zpe.thermalcorrenthalpy: 0.221281 hartree
zpe.thermalcorrgfe: 0.170060 hartree
zpe.sumelectzpe: -613.898681 hartree
zpe.sumelectthermal: -613.886416 hartree
zpe.sumelectthermalent: -613.885471 hartree
zpe.sumelectthermalfe: -613.936692 hartree
dipole: 0.0000 0.0000 0.0003
dipole: 0.0003
quadrupole: -52.2298 -77.9479 -87.3428
quadrupole: 4.5138 -0.0011 0.0003
quadrupole: 20.2770 -5.4410 -14.8360 4.5138 -0.0011 0.0003
hfenergy: -614.1067524 hartree
pointgroup: C01 [X(C12H12O2)]
dipole: -0.0000033 -0.0000021 -0.000121 debye
dipolederiv: -1.5056365 -0.3799527 0.00005 -0.7032807 -0.5625174 0.0000345 0.0000732 0.0000407 -0.2831594 -1.5056367 -0.3799508 0.0000648 -0.7032772 -0.5625162 0.0000382 0.0000694 0.0000048 -0.2831591 -0.1961253 -0.2326852 0.0000191 -0.0789385 0.1438995 -0.0000044 -0.0000008 0.0000062 0.0138862 -0.1961245 -0.2326848 0.0000173 -0.0789383 0.1439001 -0.0000027 0.0000235 -0.0000035 0.0138865 0.9848795 0.4542018 -0.0000595 0.9521283 0.4717363 -0.0000434 -0.0001021 -0.0000457 0.0707661 0.9848796 0.4542009 -0.0000387 0.9521267 0.4717337 -0.0000568 -0.0000357 -0.000018 0.0707656 -0.1800792 0.1439775 -0.0000066 -0.0049214 -0.1408215 0. -0.0000044 -0.0000083 -0.1848808 -0.1800798 0.143977 -0.0000079 -0.0049215 -0.1408217 -0.0000043 0.000003 -0.0000052 -0.1848812 -0.09292 0.096274 -0.0000167 -0.3865785 -0.2226225 0.0000135 0.0000107 0.0000131 -0.2198092 -0.0929204 0.0962744 -0.0000007 -0.386578 -0.2226221 0.0000109 0.0000156 -0.000021 -0.2198091 0.1789241 -0.0940326 -0.0000061 0.1755252 0.1286669 -0.0000125 -0.0000213 0.0000049 -0.1608791 0.1789245 -0.0940322 -0.0000059 0.1755253 0.1286671 -0.0000269 -0.0000169 -0.0000261 -0.1608791 0.9232428 0.1114505 -0.0000197 -0.1664605 0.1980178 0.0000111 0.0000106 0.000009 0.3232748 0.9232417 0.1114493 -0.0000299 -0.1664633 0.1980183 0.0000103 -0.0000376 -0.0000059 0.3232746 0.0440143 -0.0949037 0.000008 -0.0546438 0.0263046 0.0000065 0.0000074 0.0000064 0.1703283 0.0440142 -0.0949035 0.0000092 -0.0546435 0.0263047 0.0000114 0.000006 0.0000138 0.1703285 -0.1151671 0.0593811 0.0000117 0.0629736 0.0874341 0.000002 0.0000163 -0.0000006 0.1710172 -0.1151668 0.0593811 0.0000003 0.0629735 0.0874344 0.0000023 -0.0000052 0.0000048 0.1710171 0.0641822 0.0523049 0.0000008 0.0455944 -0.1336791 0.0000093 0.0000059 0.0000049 0.1556448 0.0641822 0.052305 0. 0.0455944 -0.1336794 0.0000164 -0.0000036 0.0000198 0.1556447 -0.0278541 -0.0809207 0.0000012 -0.1558791 -0.0526313 -0.0000015 0.000002 -0.0000022 0.1219436 -0.0387198 -0.0175517 -0.0088957 0.157234 0.0281114 0.1217586 -0.0738425 0.0825921 -0.0890722 -0.0387405 -0.0175435 0.0089184 0.1572469 0.0281013 -0.1217639 0.0738385 -0.0826034 -0.0890595 -0.0387108 -0.0175578 0.0088915 0.1572318 0.0280914 -0.1217813 0.0738219 -0.0826014 -0.0890582 -0.0387485 -0.0175371 -0.0089229 0.1572502 0.0281203 0.1217415 -0.0738585 0.0825942 -0.0890746 -0.0278552 -0.0809212 0.0000181 -0.1558799 -0.0526309 0.0000312 0.0000245 0.0000265 0.1219436 unknown
polarizability: 201.6317874|-6.4038544|159.3156185|-0.0040328|-0.0044948|64.1155483 unknown
InChI: InChI=1S/C12H12O2/c1-13-11-7-3-6-10-9(11)5-4-8-12(10)14-2/h3-8H,1-2H3
charge 0 multiplicity 1
26 atoms
O  -2.873084 -1.007194 -0.283625
O  2.872993 1.007087 -0.283895
C  -0.532527 -0.486743 -0.28375
C  0.532435 0.486638 -0.28383
C  -1.894783 -0.002539 -0.283721
C  1.894691 0.002433 -0.283838
C  -0.232643 -1.88898 -0.283701
C  0.232551 1.888875 -0.283901
C  -2.173092 1.370301 -0.283784
C  2.1730 -1.370407 -0.283785
C  1.096085 -2.312549 -0.28372
C  -1.096177 2.312443 -0.283879
C  -4.274406 -0.582028 -0.283693
C  4.274313 0.581916 -0.284038
H  -1.059405 -2.603355 -0.283647
H  1.059312 2.60325 -0.28397
H  -3.202825 1.740538 -0.283748
H  3.202733 -1.740643 -0.283778
H  1.333132 -3.382549 -0.283693
H  -1.333224 3.382443 -0.283942
H  -4.857782 -1.514528 -0.283702
H  -4.513324 0.009829 -1.189079
H  -4.513403 0.009864 0.621646
H  4.513153 -0.010032 -1.189384
H  4.513385 -0.009887 0.621341
H  4.857693 1.514414 -0.284186
