program: Gaussian 09
title: 000252525
version: EM64L-G09RevD.01
frameworkgroup: C1[X(C12H10N2O2)]
method: RPBEPBE
basis: SDD
operation: Freq
keyword: #p
keyword: freq=noraman
keyword: PBEPBE/SDD
title: #p freq=noraman PBEPBE/SDD
converged: YES YES NO NO
title: Mulliken charges:
elementType: O O N N C C C C C C C C C C C C H H H H H H H H H H
charge: -0.340653 -0.254817 -0.454784 -0.000204 0.479240 -0.441094 -0.342316 -0.194301 -0.211678 0.381260 -0.253178 0.237881 -0.248436 -0.447241 -0.178368 -0.330989 0.225013 0.295735 0.337497 0.229947 0.229409 0.232101 0.310548 0.260907 0.233082 0.245438
chargesum: 0.00000
title: Mulliken charges with hydrogens summed into heavy atoms:
elementType: O O N N C C C C C C C C C C C C
charge: -0.340653 -0.254817 -0.117287 -0.000204 0.479240 -0.216080 -0.046581 0.035647 0.017731 0.381260 -0.021077 0.237881 0.062112 -0.186334 0.054714 -0.085550
polarizability: 2.61346084e+02 4.85259974e+00 1.48204610e+02 -1.37483529e-01 5.39496214e-02 5.77472491e+01
1716.lowfreq: -4.5104 0.0005 0.0006 0.0007 4.2435 16.2768 24.6886 33.1611 66.5064
frequency: 24.4810 33.0177 66.4846 72.1504 93.0495 201.9843 225.1781 225.7753 256.1004 331.1843 353.7006 407.9383 408.1648 493.6738 509.5191 513.5383 600.7124 612.9552 643.8347 645.7131 690.4609 697.4094 702.2649 715.0249 768.5858 778.7693 814.9273 843.1091 857.5555 908.6474 917.1489 937.0549 942.8970 974.5568 985.6557 991.2656 997.9861 998.4730 1027.6320 1033.3835 1091.7117 1113.5350 1144.4648 1174.6946 1190.5039 1193.0410 1199.1849 1259.4520 1315.1441 1325.6578 1328.7756 1386.4270 1413.9349 1433.6120 1448.0936 1486.7212 1514.2154 1557.2764 1571.2022 1603.2787 1617.4090 1685.5764 3117.1907 3135.9685 3139.1053 3144.0028 3148.0338 3163.8226 3168.1591 3190.9706 3209.5237 3540.5276
redmass: 4.4168 6.9178 6.8533 5.7215 5.7441 5.4984 5.4614 5.3741 4.4047 8.6297 6.0962 3.2761 2.9365 4.0050 2.9207 8.0452 7.7717 6.4863 7.1483 1.7183 2.5076 2.1825 10.3035 2.2559 1.6571 7.1854 1.4778 1.2622 6.0112 1.3979 1.4259 1.4411 9.9280 1.3578 6.1949 1.3396 4.0962 1.3068 2.3884 2.4389 1.5737 1.5902 3.6901 1.0514 3.1044 1.1125 1.3357 2.1144 2.9516 1.7692 1.4008 7.2581 2.2212 2.2510 2.1008 2.2070 2.1848 6.1107 5.9379 5.2202 6.0271 9.7889 1.0885 1.0870 1.0875 1.0922 1.0935 1.0974 1.0995 1.0954 1.0956 1.0761
irintensity: 4.6027 0.0431 3.6121 0.3354 0.3602 10.9527 0.0771 0.1001 3.5529 3.2345 2.9765 2.0305 0.1565 0.4146 26.3570 5.7215 15.6428 0.4568 1.5854 12.7785 16.0716 68.1261 9.4647 44.2934 111.0499 2.5057 61.2170 0.2937 12.9432 4.8056 14.5588 4.2228 210.6842 0.0569 0.3866 2.8884 48.8412 2.5866 7.0921 19.8673 56.1408 51.3600 576.5041 1.1813 294.8952 2.5783 64.7731 3.7140 7.9182 50.2707 31.5332 63.4324 103.1388 165.9680 104.6002 14.8033 487.6631 31.8594 8.9997 23.1283 76.4978 246.0601 12.7443 0.4445 9.2340 13.4956 27.5666 25.0725 22.2499 5.5189 5.1511 34.6046
temp: 298.150 k
press: 1.00000 atm
elementType: 8 8 7 7 6 6 6 6 6 6 6 6 6 6 6 6 1 1 1 1 1 1 1 1 1 1
symmnumber: 1
zpe: 516267.5 jmol-1
zpe.correction: 0.196636 hartree
zpe.thermalcorrener: 0.209752 hartree
zpe.thermalcorrenthalpy: 0.210696 hartree
zpe.thermalcorrgfe: 0.154682 hartree
zpe.sumelectzpe: -722.112647 hartree
zpe.sumelectthermal: -722.099531 hartree
zpe.sumelectthermalent: -722.098587 hartree
zpe.sumelectthermalfe: -722.154602 hartree
dipole: -2.6502 -0.2333 0.0463
dipole: 2.6609
quadrupole: -88.4720 -85.1607 -97.9466
quadrupole: 13.4960 0.0921 0.0283
quadrupole: 2.0544 5.3657 -7.4202 13.4960 0.0921 0.0283
hfenergy: -722.3092833 hartree
pointgroup: C01[X(C12H10N2O2)]
dipole: -1.0453199 -0.0506739 -0.0259891 debye
dipolederiv: -2.9307029 0.156958 0.0703448 0.5873416 -0.3774507 -0.1064342 0.3665001 -0.1113997 -0.2796563 -0.8804026 -0.024261 -0.0232122 -0.1596245 -0.70087 -0.2524892 -0.1165235 -0.2527507 -0.4985455 -2.2654194 -0.0605252 -0.0644195 -0.391894 -0.3428835 -0.014613 -0.2915872 -0.0114532 -0.3388966 -0.2811159 0.0494936 0.0345737 0.0505247 -0.255717 -0.008591 0.0338353 -0.0087102 -0.2482468 1.4327939 -0.1149726 -0.0633261 -0.3886484 0.0876023 -0.0129396 -0.2483406 -0.0095817 0.0909337 -0.3583456 0.0245721 0.0148049 -0.0901524 -0.0278 0.1237289 -0.0629794 0.1249239 -0.1262429 -0.275367 0.021495 0.0129855 0.2177529 -0.1213043 0.0339114 0.1466062 0.0316641 -0.1443885 0.1230375 0.0105405 0.0098212 0.0828213 0.0296916 0.1127594 0.0589782 0.1120218 -0.0575403 0.0733632 -0.0039116 -0.0004824 -0.0824429 0.0699139 0.1413896 -0.0542552 0.1422439 -0.0427756 1.9141982 0.0707958 0.0715161 0.271764 0.0014833 -0.1038785 0.20405 -0.1074374 0.0851107 -0.0551979 -0.0449518 -0.02957 -0.0269446 -0.1515863 0.0209215 -0.0169265 0.0206657 -0.1686769 3.3461607 -0.0030781 0.0387574 -0.0393924 0.9922401 0.4429844 0.0128028 0.4471562 0.6307196 -0.2513012 0.0072332 0.0034609 -0.1873 -0.0531159 0.0506982 -0.1318328 0.0515123 -0.0926647 -0.2326264 -0.0615589 -0.046087 0.1566605 0.1472132 0.179549 0.1085785 0.1773662 0.0196778 -0.1018289 -0.0012266 -0.0013381 0.150599 0.0340737 0.1001499 0.1067695 0.097591 -0.0356138 0.2548277 0.0775716 0.0580465 -0.0841629 -0.0250599 0.0507837 -0.0554821 0.0529714 -0.0627494 0.0576814 0.0799564 0.0533423 0.0628539 -0.0062106 -0.1196066 0.0415797 -0.1194245 0.0893611 0.135502 -0.0525432 -0.0360645 -0.0578832 0.104316 -0.0526933 -0.0396391 -0.0526171 0.1444146 0.2036418 -0.0239494 -0.017409 0.0424153 0.2195172 -0.0740197 0.0272269 -0.0748604 0.2787118 -0.0292132 -0.0803761 -0.0567004 -0.0963887 0.0373196 -0.0835856 -0.067609 -0.0834223 0.1009653 0.0580611 0.0364744 0.0238495 0.0642686 -0.0180442 -0.116522 0.0428684 -0.1168173 0.0749275 -0.122643 0.0425457 0.026002 0.0447816 0.1069411 -0.0425028 0.0275569 -0.0425308 0.1412803 0.193733 0.0449276 0.03245 0.0591235 0.1110683 -0.0446217 0.0431622 -0.0437596 0.14435 0.0700921 -0.0604627 -0.0431573 -0.0820441 0.0308222 -0.0824753 -0.057951 -0.0820573 0.0881884 0.0449909 -0.0459832 -0.0337413 -0.0769569 0.0032818 -0.108651 -0.0556315 -0.1080367 0.0796126 -0.1239192 -0.0447634 -0.034447 -0.027072 0.1045581 -0.0332525 -0.0217566 -0.0332575 0.1277439 unknown
polarizability: 261.5256028|-0.2863012|118.8792357|2.2057963|42.1903174|86.8931051 unknown
InChI: InChI=1S/C12H10N2O2/c15-12(14-10-5-2-1-3-6-10)16-11-7-4-8-13-9-11/h1-9,14H
charge 0 multiplicity 1
26 atoms
O  1.112825 -0.656338 -0.368025
O  0.088941 1.137009 0.832091
N  -1.122752 -0.541349 -0.321826
N  4.737366 -1.084553 -0.63579
C  -2.482777 -0.183339 -0.092677
C  -3.476752 -1.016864 -0.67088
C  -2.864364 0.948287 0.674211
C  -4.842084 -0.722655 -0.484032
C  -4.236579 1.227779 0.851021
C  2.47137 -0.331275 -0.129593
C  -5.231539 0.402795 0.279051
C  0.008256 0.103697 0.130903
C  2.956085 0.752801 0.639053
C  3.388672 -1.220006 -0.745475
C  4.359192 0.889448 0.749715
C  5.209047 -0.03634 0.10685
H  -3.181423 -1.891774 -1.264074
H  -2.098416 1.587874 1.117109
H  -0.94596 -1.375572 -0.886377
H  -5.599962 -1.372579 -0.934543
H  -4.52714 2.102201 1.443748
H  -6.292338 0.631548 0.424232
H  2.271623 1.450476 1.122015
H  3.015297 -2.060472 -1.340476
H  4.783524 1.712573 1.333342
H  6.298691 0.04803 0.177427
