program: Gaussian 09
title: 000252522
version: EM64L-G09RevD.01
frameworkgroup: C1[X(C10H21NO)]
method: RPBEPBE
basis: SDD
operation: Freq
keyword: #p
keyword: freq=noraman
keyword: PBEPBE/SDD
title: #p freq=noraman PBEPBE/SDD
converged: YES YES NO NO
title: Mulliken charges:
elementType: O N C C C C C C C C C C H H H H H H H H H H H H H H H H H H H H H
charge: -0.274294 -0.372557 -0.360722 -0.336978 -0.536675 -0.332101 -0.355492 -0.391897 0.238843 -0.351328 -0.694326 -0.685175 0.237775 0.195755 0.181959 0.185269 0.227600 0.200944 0.219330 0.193575 0.194813 0.200391 0.204742 0.257571 0.190147 0.193861 0.294801 0.216570 0.207777 0.210135 0.214424 0.215270 0.209991
chargesum: 0.00000
title: Mulliken charges with hydrogens summed into heavy atoms:
elementType: O N C C C C C C C C C C
charge: -0.274294 -0.077756 0.072808 0.030251 -0.108130 0.080804 0.039712 0.070416 0.238843 0.032681 -0.059844 -0.045489
polarizability: 1.55210554e+02 3.95172445e-01 1.07087469e+02 -4.99747260e+00 -3.33003530e+00 9.92987522e+01
1716.lowfreq: -26.9509 -18.3417 -3.6448 -2.2072 -0.0004 -0.0002 0.0004 22.4794 39.5261
frequency: -17.9579 19.8168 39.5059 42.5758 69.9327 91.0757 102.4987 122.8003 139.5009 189.0140 228.0690 230.5316 232.4797 276.2911 295.0244 347.3070 398.5188 445.9494 516.2261 553.4452 597.9364 692.8327 725.6362 736.0617 755.4741 803.5658 834.5176 848.0627 879.2594 902.6498 950.7308 965.6231 974.1069 1006.8852 1042.6243 1060.1637 1076.4181 1079.4836 1108.7003 1114.4197 1126.6143 1134.7724 1191.8947 1214.0382 1227.4798 1241.6379 1259.0474 1265.5372 1285.5351 1286.3764 1291.2461 1306.8710 1313.8349 1343.4352 1350.0599 1354.2260 1365.5375 1387.1408 1391.1461 1443.9665 1448.4184 1457.9052 1464.8395 1469.8388 1473.0967 1477.1365 1477.3771 1480.5177 1483.0666 1486.0311 1487.7089 1616.4410 2949.7598 2957.0439 2968.2614 2968.7785 2970.9106 2974.2711 2976.3603 2980.4990 2986.9825 2992.8286 3002.7300 3019.6903 3024.8491 3043.3586 3057.6034 3067.9110 3070.6498 3070.7893 3072.3971 3074.1512 3557.1592
redmass: 2.5747 4.3128 3.4392 2.2009 1.6900 2.5636 2.7891 1.9448 2.7656 3.5219 2.8461 1.1751 1.1757 2.4274 3.2076 2.7083 3.0921 2.7379 2.1199 1.4070 2.7387 3.3101 1.0775 1.2051 1.1954 1.8134 1.5051 1.6339 1.9506 1.7369 1.3795 1.8745 1.5778 3.8078 3.2670 2.7911 1.8452 1.9795 2.1280 2.2977 2.2460 1.9028 1.6921 1.5073 1.3521 1.3487 1.2745 1.3321 1.0655 1.1072 1.1675 1.2816 1.3361 1.4468 1.5447 1.6625 1.3586 1.2167 1.2119 1.1028 1.1377 1.0825 1.0683 1.0726 1.0768 1.0428 1.0446 1.0711 1.6503 1.1228 1.0875 6.2467 1.0589 1.0589 1.0586 1.0575 1.0385 1.0398 1.0576 1.0670 1.0656 1.0940 1.0984 1.0978 1.1031 1.1006 1.1027 1.1009 1.0997 1.0993 1.1000 1.0995 1.0776
irintensity: 1.6577 3.2363 0.5012 1.8004 0.4708 1.7396 2.5436 0.0205 1.9482 0.9126 5.8266 0.5459 0.5288 2.3723 5.6392 3.6142 9.4028 2.5161 5.7094 102.8996 8.9034 0.3221 11.6180 13.5606 0.6289 2.8212 2.8189 3.0268 4.5366 1.0994 0.8872 3.6861 19.9205 1.1678 2.3772 1.2596 5.1590 1.2095 19.3867 4.5682 1.9610 2.5241 18.2905 16.3975 16.1955 25.6818 14.0573 34.8265 0.7973 0.1470 3.2771 3.2247 39.1344 7.5421 0.3653 3.0468 4.2392 10.8828 9.5275 15.8695 41.2175 4.7590 0.2184 0.6798 14.5235 12.3477 7.5559 4.3445 188.5946 40.2870 21.7305 156.1764 15.3593 28.8094 49.1939 8.6471 33.2675 21.3472 60.0156 52.0979 42.7374 13.5138 7.4065 23.6482 3.9086 47.2198 29.0075 113.4229 48.1381 56.8081 29.9902 58.2779 11.7322
temp: 298.150 k
press: 1.00000 atm
elementType: 8 7 6 6 6 6 6 6 6 6 6 6 1 1 1 1 1 1 1 1 1 1 1 1 1 1 1 1 1 1 1 1 1
symmnumber: 1
zpe: 776887.7 jmol-1
zpe.correction: 0.295901 hartree
zpe.thermalcorrener: 0.310842 hartree
zpe.thermalcorrenthalpy: 0.311786 hartree
zpe.thermalcorrgfe: 0.251635 hartree
zpe.sumelectzpe: -522.656045 hartree
zpe.sumelectthermal: -522.641103 hartree
zpe.sumelectthermalent: -522.640159 hartree
zpe.sumelectthermalfe: -522.700311 hartree
dipole: -1.0912 -2.7717 2.3535
dipole: 3.7963
quadrupole: -70.3948 -81.1330 -76.6199
quadrupole: -0.2527 -2.4527 2.7336
quadrupole: 5.6545 -5.0838 -0.5707 -0.2527 -2.4527 2.7336
hfenergy: -522.9519457 hartree
pointgroup: C01 [X(C10H21N1O1)]
dipole: 0.4190811 -0.5342932 -1.3302961 debye
polarizability: 155.3112948|0.531834|102.4960134|-4.2731566|5.213173|103.7894669 unknown
InChI: InChI=1S/C10H21NO/c1-3-5-7-8-10(12)11-9-6-4-2/h11H,3-9H2,1-2H3
charge 0 multiplicity 1
33 atoms
O  0.229333 0.888091 1.607896
N  1.324016 0.402574 -0.387555
C  -2.303798 0.287584 0.169972
C  -3.540669 -0.565926 -0.183915
C  -0.970363 -0.462559 -0.060648
C  3.691779 0.149792 0.464838
C  -4.873026 0.186473 0.037415
C  2.569477 1.098653 -0.017379
C  0.231151 0.332012 0.465887
C  4.200718 -0.828468 -0.618771
C  -6.112535 -0.667326 -0.306614
C  5.351683 -1.725979 -0.115026
H  -2.342836 0.597473 1.231128
H  -2.309956 1.219982 -0.430198
H  -3.480726 -0.89645 -1.24265
H  -3.53766 -1.490474 0.431387
H  -1.002906 -1.422437 0.493805
H  -0.847028 -0.713072 -1.133326
H  3.326373 -0.417109 1.343164
H  4.538898 0.773151 0.818001
H  -4.875997 1.109978 -0.576943
H  -4.930563 0.517249 1.094172
H  2.920237 1.687614 -0.887901
H  2.300881 1.800016 0.791795
H  4.541787 -0.249705 -1.502629
H  3.363291 -1.469809 -0.96256
H  1.272156 -0.070831 -1.290349
H  -7.049988 -0.105053 -0.1413
H  -6.092776 -0.987457 -1.365766
H  -6.15134 -1.579637 0.318292
H  5.026801 -2.3386 0.746717
H  5.706102 -2.413252 -0.905014
H  6.213381 -1.1156 0.214773
