program: Gaussian 09
title: 000252519
version: EM64L-G09RevD.01
frameworkgroup: C1[X(C10H18N4)]
method: RPBEPBE
basis: SDD
operation: Freq
keyword: #pfreq=noraman
keyword: PBEPBE/SDD
title: #p freq=noraman PBEPBE/SDD
converged: YES YES NO NO
title: Mulliken charges:
elementType: N N N N C C C C C C C C C C H H H H H H H H H H H H H H H H H H
charge: -0.336921 -0.336976 -0.010124 -0.010228 0.258819 0.258851 -0.391078 -0.391121 -0.690100 -0.712987 -0.690079 -0.712994 -0.183286 -0.183164 0.262444 0.171819 0.171811 0.262500 0.254444 0.254468 0.240080 0.232518 0.211715 0.254660 0.229794 0.208185 0.240138 0.232523 0.211730 0.254607 0.229774 0.208178
chargesum: 0.00000
title: Mulliken charges with hydrogens summed into heavy atoms:
elementType: N N N N C C C C C C C C C C
charge: -0.082477 -0.082508 -0.010124 -0.010228 0.258819 0.258851 0.043184 0.043191 -0.005787 -0.020349 -0.005687 -0.020435 -0.183286 -0.183164
polarizability: 1.45551003e+02 4.35565299e-02 1.32263060e+02 8.73885319e-01 1.16033572e-02 1.10421220e+02
1716.lowfreq: -5.5580 -3.5829 -2.9621 -0.0011 -0.0010 -0.0009 17.6470 30.9318 66.2041
frequency: 17.4230 30.8912 66.1845 72.3318 110.1023 128.3033 143.9455 174.8653 175.7995 184.3041 212.1572 213.1150 218.2997 233.1377 258.6239 260.0659 311.2275 348.7697 371.1659 385.7099 389.4786 431.4994 453.2191 517.7885 545.0511 565.5347 567.5249 596.3835 612.0386 685.5853 701.9498 827.8849 890.9528 894.7750 911.3004 924.7153 926.9694 948.5178 1001.7900 1002.7509 1064.7256 1080.2806 1115.4713 1120.4619 1157.0299 1159.0320 1172.6895 1187.9227 1199.6452 1233.9270 1260.3488 1284.8488 1326.2339 1370.0332 1373.0169 1386.3350 1390.3678 1392.9278 1441.4765 1443.5083 1456.0881 1456.4307 1463.4893 1463.7896 1475.8464 1476.0878 1483.4386 1488.3399 1488.7630 1494.7771 2187.9322 2187.9823 2858.8038 2862.6797 2984.4296 2984.4435 2990.2737 2990.3454 3039.2898 3054.3916 3084.8685 3084.8863 3091.2887 3091.4029 3096.4045 3096.5249 3118.2283 3118.2564 3459.2444 3459.7135
redmass: 5.2338 5.1453 3.4575 5.6257 1.8053 4.9833 3.0161 3.1083 3.3962 2.9910 1.2403 1.1162 1.8810 3.4894 1.1016 1.1444 2.9576 2.4467 2.6760 2.4942 2.6755 2.7279 4.3739 1.7100 1.8945 5.3035 4.5579 4.6758 4.0491 3.9522 3.9763 1.1675 1.9861 2.1205 1.9150 1.6072 1.7940 2.1145 1.3029 1.2970 3.5094 1.5672 2.8588 3.7473 2.4419 2.9799 1.5217 2.6585 2.9723 2.7385 2.1838 1.1536 1.2641 1.2134 1.1861 1.2876 1.1972 1.2503 1.2155 1.2041 1.0517 1.0517 1.0502 1.0514 1.0640 1.0644 1.0630 1.0776 1.0801 1.0873 12.6380 12.6372 1.0714 1.0701 1.0350 1.0350 1.0373 1.0373 1.0851 1.0922 1.0997 1.0997 1.0974 1.0974 1.1006 1.1005 1.1016 1.1016 1.0744 1.0745
irintensity: 0.3067 0.2890 0.4938 9.9982 3.7761 0.1311 2.1578 0.1499 2.4394 3.3037 0.1794 1.5907 0.1276 0.9787 1.3794 0.1861 7.0984 0.1237 0.7300 15.6704 0.1811 4.1609 20.8575 184.2957 8.8035 6.9687 0.2356 5.6191 6.2352 2.7287 3.2039 0.6008 3.5422 1.3800 1.2740 0.0211 7.6657 0.0283 0.0040 0.4778 0.9682 31.7973 0.2004 64.4305 14.9016 21.7729 22.3905 108.0814 4.7552 110.2052 33.0481 6.8922 0.6013 8.0404 35.0966 3.4895 36.2539 5.0750 7.8195 31.4580 0.0884 11.4609 4.4719 2.5248 4.2324 0.6496 0.7856 24.9073 11.2833 7.4285 0.8918 3.0868 130.1155 62.4457 17.1530 12.7238 21.7995 22.0543 3.8177 21.5063 12.4753 2.8432 20.5832 60.5690 50.2173 1.4203 31.0537 5.4074 1.2284 0.3530
temp: 298.150 k
press: 1.00000 atm
elementType: 7 7 7 7 6 6 6 6 6 6 6 6 6 6 1 1 1 1 1 1 1 1 1 1 1 1 1 1 1 1 1 1
symmnumber: 1
zpe: 706160.7 jmol-1
zpe.correction: 0.268962 hartree
zpe.thermalcorrener: 0.286478 hartree
zpe.thermalcorrenthalpy: 0.287422 hartree
zpe.thermalcorrgfe: 0.222983 hartree
zpe.sumelectzpe: -609.705044 hartree
zpe.sumelectthermal: -609.687528 hartree
zpe.sumelectthermalent: -609.686584 hartree
zpe.sumelectthermalfe: -609.751024 hartree
dipole: -0.0061 -8.8449 0.0084
dipole: 8.8449
quadrupole: -80.5472 -100.7445 -85.6860
quadrupole: -0.0076 7.9264 0.0063
quadrupole: 8.4454 -11.7519 3.3065 -0.0076 7.9264 0.0063
hfenergy: -609.9740065 hartree
pointgroup: C01 [X(C10H18N4)]
dipole: -0.0018447 3.4798338 0.0126527 debye
polarizability: 145.3694674|-0.0334985|132.2624996|-2.666148|0.1129036|110.6033162 unknown
InChI: InChI=1S/C10H18N4/c1-9(2,7-11)13-5-6-14-10(3,4)8-12/h13-14H,5-6H2,1-4H3
charge 0 multiplicity 1
32 atoms
N  1.750579 0.579277 -0.681265
N  -1.750469 0.575259 0.685504
N  3.372422 -2.223427 0.556268
N  -3.36827 -2.218429 -0.57495
C  3.156075 0.322353 -0.275688
C  -3.155827 0.320761 0.277939
C  0.691571 0.512298 0.343198
C  -0.691244 0.514376 -0.339056
C  3.669922 1.242576 0.880329
C  4.051163 0.495114 -1.533798
C  -3.669213 1.247695 -0.872929
C  -4.05144 0.486243 1.536643
C  3.260753 -1.096288 0.182272
C  -3.260413 -1.095228 -0.188202
H  0.802743 -0.427927 0.912187
H  0.733563 1.350051 1.084389
H  -0.733051 1.356514 -1.075284
H  -0.802348 -0.422435 -0.913669
H  1.685331 1.410321 -1.282772
H  -1.685382 1.402567 1.292149
H  3.048992 1.13146 1.785468
H  4.712546 0.996603 1.148088
H  3.629947 2.296885 0.549509
H  3.700149 -0.164012 -2.344393
H  5.102884 0.256636 -1.305306
H  4.002067 1.545087 -1.879612
H  -3.047815 1.141978 -1.778393
H  -4.711655 1.003099 -1.142658
H  -3.629613 2.300054 -0.535914
H  -3.70082 -0.177577 2.343574
H  -5.103066 0.249122 1.306316
H  -4.002477 1.534194 1.888554
