program: Gaussian 09
title: 000252506
version: EM64L-G09RevD.01
frameworkgroup: C1[X(C6H13NO2)]
method: RPBEPBE
basis: SDD
operation: Freq
keyword: #p
keyword: freq=noraman
keyword: PBEPBE/SDD
title: #p freq=noraman PBEPBE/SDD
converged: YES YES NO NO
title: Mulliken charges:
elementType: O O N C C C C C C H H H H H H H H H H H H H
charge: -0.283959 -0.448040 -0.363059 -0.496243 -0.349152 -0.357118 0.249627 -0.682166 -0.342039 0.225378 0.198446 0.241074 0.201368 0.216229 0.257289 0.316521 0.210269 0.205831 0.221113 0.202141 0.235161 0.341328
chargesum: 0.00000
title: Mulliken charges with hydrogens summed into heavy atoms:
elementType: O O N C C C C C C
charge: -0.283959 -0.106711 -0.046538 -0.072419 0.093290 0.116401 0.249627 -0.044953 0.095263
polarizability: 1.01589252e+02 1.13727669e+00 7.55775880e+01 4.04875257e+00 5.01797246e-01 6.29557930e+01
1716.lowfreq: -4.1694 -0.0005 0.0001 0.0010 2.2959 11.6482 33.1108 48.0580 72.4660
frequency: 32.8992 48.0167 72.4364 92.8074 120.6392 196.9521 235.0595 250.2033 291.5000 333.9506 344.0408 407.2175 510.5849 589.6436 662.0155 713.5442 747.7201 822.1824 860.8010 884.8840 889.1605 953.6066 1022.7101 1041.2861 1058.1611 1072.4700 1100.3267 1131.1741 1171.2659 1199.9281 1228.1117 1246.2981 1278.7751 1306.7209 1322.9682 1345.6279 1359.9775 1373.5891 1390.2754 1449.5963 1461.0098 1473.8310 1476.1704 1478.1619 1478.9325 1486.4748 1611.1523 2949.4485 2971.6068 2975.3122 2989.1244 2991.4144 3028.0163 3049.1945 3055.6357 3074.4581 3076.5052 3098.7478 3534.8970 3559.3221
redmass: 2.5760 4.4573 2.8474 2.6069 2.9084 3.4967 1.1364 4.2567 2.6434 2.2845 1.2048 2.9031 2.6453 3.2565 1.1909 3.5056 1.1674 2.1481 1.7211 1.7547 2.2752 2.9326 1.8534 1.9593 2.5896 1.6938 2.1416 2.7659 1.2923 1.4731 1.2923 1.4093 1.2227 1.2796 1.2684 1.4587 1.4751 1.2101 1.2152 1.1038 1.0856 1.2383 1.0506 1.1474 1.4973 1.0828 6.7910 1.0693 1.0377 1.0571 1.0668 1.0638 1.0978 1.1006 1.0914 1.0988 1.1021 1.0994 1.0776 1.0663
irintensity: 0.3481 6.8244 2.8123 3.5240 9.6846 12.2372 0.0879 12.2022 0.2221 33.1907 130.4098 8.4884 13.9720 20.8382 110.0579 3.8830 8.8704 6.4058 12.5347 3.8171 6.2404 21.8085 88.5020 1.6095 3.0933 5.8581 15.3965 4.3314 20.1593 2.2227 36.8040 60.4651 14.9205 10.1999 12.4815 4.1607 16.3085 11.1905 10.0375 10.9485 12.5973 110.8672 0.8313 38.0906 156.3222 17.5492 172.2305 54.1330 31.1605 23.1885 73.1309 33.5704 12.4565 0.0540 11.6773 48.6963 80.1735 26.8974 40.1362 4.2000
temp: 298.150 k
press: 1.00000 atm
elementType: 8 8 7 6 6 6 6 6 6 1 1 1 1 1 1 1 1 1 1 1 1 1
symmnumber: 1
zpe: 496321.9 jmol-1
zpe.correction: 0.189039 hartree
zpe.thermalcorrener: 0.200203 hartree
zpe.thermalcorrenthalpy: 0.201148 hartree
zpe.thermalcorrgfe: 0.150774 hartree
zpe.sumelectzpe: -440.895187 hartree
zpe.sumelectthermal: -440.884022 hartree
zpe.sumelectthermalent: -440.883078 hartree
zpe.sumelectthermalfe: -440.933452 hartree
dipole: -1.8814 -2.1516 -1.2740
dipole: 3.1292
quadrupole: -47.5662 -64.3706 -53.2130
quadrupole: -6.7291 5.5197 2.2059
quadrupole: 7.4837 -9.3207 1.8370 -6.7291 5.5197 2.2059
hfenergy: -441.0842257 hartree
pointgroup: C01 [X(C6H13N1O2)]
dipole: 0.6890807 0.5705254 -0.8457941 debye
dipolederiv: -0.7310191 0.0492002 0.0392079 -0.2366212 -0.8669018 0.282087 0.1710025 0.2061898 -0.509642 -0.7004173 -0.167297 -0.0385148 -0.2777137 -0.5289805 0.2895839 -0.0291407 0.3058867 -0.4205147 -1.2657609 -0.2170395 0.2306092 -0.200015 -0.437193 0.0127653 0.1896687 0.0166257 -0.5063122 -0.3321739 0.1410858 -0.0452846 0.1491386 -0.0271729 -0.0259959 -0.0163467 -0.0262682 0.1318882 0.1642973 -0.007102 0.0071355 0.1039741 0.0201737 0.0073824 0.0256154 0.0064933 0.1523835 0.3312238 -0.1419334 -0.0597236 -0.3534684 0.0849814 0.196588 0.0428022 0.1110952 0.226761 1.4668762 0.105033 -0.3503967 0.2746497 0.9561597 -0.4239174 -0.5500846 -0.3567473 0.4476976 -0.0683919 0.0626642 -0.016385 0.0131542 0.0666071 -0.0179311 -0.03246 -0.0155682 0.0941781 0.4264124 0.0952596 -0.0379283 0.1572082 0.45583 -0.2287016 -0.0275368 -0.2247786 0.4410096 0.0517239 0.0207426 0.041229 0.0239171 0.0501775 -0.0446095 0.018139 -0.0724987 -0.0992898 0.0025119 -0.0549379 0.0310296 -0.046624 -0.1029078 0.0885315 0.0204023 0.1275277 0.0127104 0.0668284 -0.0101276 0.0022457 -0.0429716 -0.0650358 0.0714691 0.0244303 0.0924896 0.0364087 0.0156637 0.0249126 0.0490451 0.0063946 0.0509521 -0.0701482 0.0178291 -0.0921671 -0.1568346 -0.0876381 0.0189939 0.0512954 0.0943217 0.0333374 -0.0982088 0.0793704 -0.1333551 -0.1311312 0.1244389 -0.0452111 0.0310514 0.0609878 0.0303733 0.0590965 -0.0504997 0.076939 0.0332789 0.2551826 0.042474 0.0197805 0.1132439 0.1560731 0.0507174 0.0140131 0.0661105 0.269504 0.0737127 0.0214151 0.0178199 0.0446717 0.0562225 -0.056604 0.0767707 -0.081623 -0.1581456 0.0695173 -0.0502323 0.043332 0.0212122 -0.1190636 0.1152774 0.0160381 0.1247155 0.0142111 -0.162076 -0.0632655 -0.0811085 -0.0980836 0.0352425 -0.0471953 -0.0939954 -0.0398827 0.0655302 -0.2009092 0.0965131 -0.0125769 0.0990789 -0.0507451 0.0712415 0.0364526 0.0344967 0.0504304 0.1105083 0.0061678 0.0380294 -0.0243355 0.0041776 -0.0766144 0.003673 -0.0349316 -0.094684 0.3894889 0.0726846 0.0401078 0.1178801 0.1976926 -0.1548141 0.0638565 -0.0907493 0.1005624 unknown
polarizability: 101.1141502|-0.4153568|72.9494325|-5.8215248|-5.1980992|66.0590506 unknown
InChI: InChI=1S/C6H13NO2/c1-2-3-6(9)7-4-5-8/h7-8H,2-5H2,1H3
charge 0 multiplicity 1
22 atoms
O  -0.464508 -1.583665 0.887003
O  3.272093 1.348803 -0.823947
N  0.791477 0.057817 -0.176324
C  -1.584629 0.528122 0.307584
C  -2.853401 -0.167952 -0.243781
C  2.043037 -0.705971 -0.158496
C  -0.387793 -0.426212 0.366708
C  -4.098295 0.739811 -0.167141
C  3.225104 0.227479 0.14064
H  -1.790112 0.868774 1.342266
H  -1.349243 1.430698 -0.290434
H  -3.014348 -1.09577 0.334915
H  -2.675892 -0.476766 -1.292784
H  2.204084 -1.219679 -1.131137
H  1.942168 -1.491346 0.612504
H  0.83257 0.993147 -0.58865
H  -4.31456 1.02844 0.878966
H  -3.957496 1.669736 -0.750456
H  -4.991227 0.224473 -0.565516
H  4.177623 -0.340173 0.140422
H  3.094334 0.715869 1.119335
H  3.566917 1.004064 -1.705077
