program: Gaussian 09
title: 000252490
version: EM64L-G09RevD.01
frameworkgroup: C1[X(C10H9N)]
method: RPBEPBE
basis: SDD
operation: Freq
keyword: #pfreq=noraman
keyword: PBEPBE/SDD
title: #p freq=noraman PBEPBE/SDD
converged: YES YES NO NO
title: Mulliken charges:
elementType: N C C C C C C C C C C H H H H H H H H H
charge: -0.028543 -0.264364 -0.207508 -0.527944 0.456831 -0.155395 -0.389893 -0.429473 -0.227811 -0.219994 -0.237243 0.271575 0.279090 0.257465 0.251038 0.243027 0.238321 0.230220 0.228647 0.231953
chargesum: 0.00000
title: Mulliken charges with hydrogens summed into heavy atoms:
elementType: N C C C C C C C C C C
charge: -0.028543 0.007211 0.071582 -0.019441 0.456831 -0.155395 -0.146866 -0.191152 0.002409 0.008653 -0.005290
polarizability: 1.52573191e+02 -7.21827033e+00 1.06129147e+02 7.88698227e+00 -5.84402645e-01 5.77719532e+01
1716.lowfreq: -10.9223 -5.4787 -0.0007 -0.0005 0.0005 7.2457 21.5834 82.9755 106.6205
frequency: 20.7197 82.9517 106.6112 178.2132 237.4779 282.6189 403.3719 420.3726 436.3343 520.1174 527.7738 586.4570 615.7952 705.4517 731.9831 774.4890 799.4343 845.3569 857.7236 919.6176 925.6724 951.5448 980.3828 991.0741 998.6622 1026.2794 1045.0587 1070.8413 1085.3822 1091.9217 1119.7044 1173.7774 1178.6399 1188.3582 1237.1882 1296.1622 1317.2194 1375.7383 1389.1594 1435.0893 1460.9980 1489.2663 1589.1381 1614.7341 2187.0270 3103.9607 3112.2272 3122.7292 3126.0697 3136.2467 3138.6344 3149.0867 3165.6926 3218.5348
redmass: 3.8252 6.4765 4.0673 5.8276 4.0337 4.4378 2.8278 3.6751 4.7469 4.0682 4.2421 3.6553 6.3525 1.9075 2.5851 2.0500 2.0740 4.6304 1.3587 1.5603 1.3750 3.0571 1.3953 6.0156 1.3155 2.1741 1.5420 1.2503 1.3575 1.4062 1.5419 1.0531 2.3788 1.1301 1.4478 1.4785 1.3489 6.5696 2.2438 2.1541 1.2403 2.5478 6.1119 6.1240 12.4670 1.0849 1.0607 1.0856 1.0873 1.0883 1.0918 1.0964 1.1016 1.1163
irintensity: 1.2572 3.0009 1.1003 4.2885 1.3338 2.1765 0.0509 1.6367 1.6294 17.9263 2.5436 3.4889 0.1038 47.4783 16.6038 39.4148 3.4278 6.4770 0.3643 3.7929 2.7988 15.0628 0.1031 0.4379 0.1269 14.2467 12.2753 8.9590 2.8071 12.3251 3.3156 0.0347 1.6224 0.3033 2.2222 0.9487 1.0931 0.8359 11.4844 6.9196 19.2692 12.0652 1.1165 7.4256 58.9688 4.0939 5.7333 5.4002 0.8282 1.2207 13.2062 38.0329 20.0619 6.5815
temp: 298.150 k
press: 1.00000 atm
elementType: 7 6 6 6 6 6 6 6 6 6 6 1 1 1 1 1 1 1 1 1
symmnumber: 1
zpe: 415971.9 jmol-1
zpe.correction: 0.158435 hartree
zpe.thermalcorrener: 0.167864 hartree
zpe.thermalcorrenthalpy: 0.168809 hartree
zpe.thermalcorrgfe: 0.122249 hartree
zpe.sumelectzpe: -440.398386 hartree
zpe.sumelectthermal: -440.388957 hartree
zpe.sumelectthermalent: -440.388013 hartree
zpe.sumelectthermalfe: -440.434573 hartree
dipole: -4.0820 1.9044 -0.5498
dipole: 4.5378
quadrupole: -81.4189 -59.3568 -65.4866
quadrupole: 8.1776 0.4193 0.3141
quadrupole: -12.6648 9.3973 3.2675 8.1776 0.4193 0.3141
hfenergy: -440.5568218 hartree
pointgroup: C01 [X(C10H9N1)]
dipole: -1.6017692 -0.7533864 0.2325197 debye
dipolederiv: -0.4765887 -0.0947425 -0.0376799 -0.1333385 -0.2774289 -0.0162011 0.0951314 0.0342154 -0.2266985 0.1529421 -0.0111371 -0.0417684 0.1706973 0.1872406 0.0960942 0.0617855 0.0786142 0.0754496 -0.3193583 -0.1790424 -0.0605763 -0.3245805 -0.0212931 -0.0703431 -0.14804 -0.1015428 0.11275 0.0635474 0.0942797 -0.0176511 0.0227745 -0.1028536 -0.0159283 0.1048956 0.0989779 0.0955015 0.3160487 -0.0597476 -0.0190925 -0.0766695 -0.0483866 0.0087058 -0.1801818 0.005799 -0.0760249 0.4661498 0.2334593 -0.0177225 0.309032 0.0499487 -0.0372022 -0.2096251 -0.0940357 -0.0913329 -0.1223432 0.1047408 -0.0338818 0.1021043 0.0103938 -0.0150049 0.00805 -0.0161432 -0.1364904 -0.1783319 -0.0398826 -0.0297757 -0.0164131 0.0562304 0.0233719 0.005426 0.0150222 -0.1422808 -0.0470128 -0.0483575 -0.0271457 -0.061005 0.1120996 0.0204741 -0.0182916 0.0151159 -0.143511 0.0261206 0.0887407 -0.0357333 0.0981322 0.0533956 -0.0158984 -0.0164646 -0.0138724 -0.1386421 0.0634017 -0.0319057 -0.0515409 -0.0212099 -0.0682 0.0074667 -0.0424839 0.0065693 -0.1541949 -0.0710441 0.024649 0.0447175 0.0299178 0.0794569 0.0548163 0.0357973 0.0405616 -0.0250392 0.0585189 -0.0446249 0.046766 -0.0615495 0.0698951 -0.0524599 0.0544297 -0.0458564 0.0150695 -0.0015639 0.0657032 0.0686185 0.0411544 0.0231652 -0.0208325 0.0719388 -0.0506596 0.0631598 0.0635149 -0.0848846 0.0758713 -0.0632221 0.0029523 0.0458298 0.0392891 0.0375145 0.0347572 0.0096696 -0.105417 0.0275902 -0.0978187 0.000026 0.0108995 0.0196962 0.0096818 0.1384423 0.0853042 0.0835736 0.0207216 0.0724825 -0.0767793 -0.0157739 0.0194186 -0.0115352 0.1392014 0.0502497 0.0611404 0.014604 0.0794812 -0.098724 -0.0146793 0.0182206 -0.0156681 0.1533808 -0.0220115 -0.0956421 0.0241643 -0.1119351 -0.0326932 0.0150342 0.0279107 0.0154494 0.1528568 -0.1172131 0.0390973 0.0495146 0.0419656 0.0815545 -0.0083687 0.0530974 -0.0082079 0.153646 unknown
polarizability: 152.2934453|7.3562341|106.151965|-9.2658395|-0.1546094|58.0288811 unknown
InChI: InChI=1S/C10H9N/c11-7-9-6-10(9)8-4-2-1-3-5-8/h1-5,9-10H,6H2
charge 0 multiplicity 1
20 atoms
N  4.22658 0.976124 -0.142704
C  0.849829 -0.413207 -0.580316
C  1.935434 -0.161498 0.511155
C  1.604524 -1.593175 0.018406
C  -0.597732 -0.143879 -0.267207
C  3.19002 0.459734 0.155326
C  -1.060818 1.194043 -0.161378
C  -1.526827 -1.203489 -0.116497
C  -2.422108 1.465854 0.09367
C  -2.890901 -0.933465 0.13977
C  -3.342604 0.401537 0.245828
H  1.165218 -0.118013 -1.58901
H  1.559836 0.103135 1.505287
H  2.352567 -2.098142 -0.597466
H  1.087955 -2.235723 0.737236
H  -0.349021 2.020546 -0.27693
H  -1.182756 -2.240167 -0.209964
H  -2.765612 2.503198 0.174308
H  -3.599139 -1.761969 0.252512
H  -4.399444 0.611757 0.444177
