program: Gaussian 09
title: 000252477
version: EM64L-G09RevD.01
frameworkgroup: C1[X(C14H29NO2)]
method: RPBEPBE
basis: SDD
operation: Freq
keyword: #p
keyword: freq=noraman
keyword: PBEPBE/SDD
title: #p freq=noraman PBEPBE/SDD
converged: YES YES NO NO
title: Mulliken charges:
elementType: O O N C C C C C C C C C C C C C C H H H H H H H H H H H H H H H H H H H H H H H H H H H H H
charge: -0.415747 -0.233544 -0.570445 -0.385433 -0.386097 -0.387165 -0.384400 -0.386495 -0.382195 -0.355710 -0.372567 -0.426398 -0.353486 -0.172426 -0.356564 -0.696840 0.132173 0.192401 0.194027 0.194196 0.192912 0.193127 0.197286 0.192276 0.193224 0.195582 0.190407 0.192154 0.191477 0.185301 0.238571 0.188889 0.189442 0.223444 0.209686 0.187741 0.187346 0.245849 0.194492 0.194792 0.209669 0.209567 0.214740 0.279506 0.278377 0.376858
chargesum: 0.00000
title: Mulliken charges with hydrogens summed into heavy atoms:
elementType: O O N C C C C C C C C C C C C C C
charge: -0.038889 -0.233544 -0.012562 0.000996 0.001011 0.003248 0.001100 -0.000506 0.001436 0.068162 0.005764 0.006732 0.021600 0.073423 0.032720 -0.062864 0.132173
polarizability: 2.22601454e+02 3.49533475e+00 1.44789327e+02 -3.33018610e+00 1.42370812e+00 1.39730181e+02
1716.lowfreq: -18.4833 -0.0016 -0.0010 0.0011 2.5183 4.9575 11.7850 16.7374 23.1819
frequency: 9.0509 16.3434 23.0605 30.1184 41.0096 60.0800 64.5697 69.8700 95.2246 104.5451 113.6282 125.4818 130.8272 135.2181 151.0912 153.7600 187.2301 208.4279 226.7822 230.0643 271.3469 286.1883 334.2435 357.9898 398.9044 421.0523 476.2171 489.8608 508.1902 592.5868 605.3634 681.5713 709.2855 719.5948 722.3540 727.7236 738.1677 756.8000 785.5433 827.8786 848.8783 876.7569 886.9577 923.1128 946.1911 980.6794 982.4880 992.2489 1017.9172 1023.2080 1027.0690 1035.7722 1052.8867 1057.4887 1073.1091 1076.8566 1080.8726 1082.0873 1087.5855 1122.0952 1141.2414 1180.3772 1196.6658 1200.0413 1217.1833 1220.4874 1233.0942 1241.9534 1256.0748 1262.1954 1278.3823 1278.7827 1279.6228 1285.8554 1289.6976 1293.2333 1295.5739 1297.3880 1303.7776 1309.8111 1329.3652 1344.5662 1352.6070 1352.7508 1356.0837 1356.5485 1361.8235 1387.0098 1457.6534 1459.0839 1459.7218 1462.5162 1463.1218 1465.2359 1468.9801 1474.1008 1475.8865 1479.2204 1483.7848 1487.2106 1488.8113 1649.7617 1654.7518 2947.2165 2947.4944 2948.7683 2949.8988 2950.6344 2953.4764 2957.9569 2962.1566 2964.7450 2967.5461 2971.0384 2975.3203 2980.9831 2983.4906 2987.3746 2993.0355 3001.1122 3011.4698 3021.4788 3025.2690 3032.5766 3037.4367 3041.9963 3057.4387 3067.5601 3069.5076 3444.3087 3499.8469 3566.9979
redmass: 2.8960 2.3177 4.5856 6.0067 4.4270 2.5562 2.1016 3.2196 1.6886 2.7704 3.5679 2.4058 2.5467 2.5447 1.9962 2.0847 3.5530 1.2349 1.1643 3.2335 2.8235 3.7107 3.2517 3.0844 3.6744 3.0274 3.2149 2.8986 2.8988 1.5418 2.1410 1.7421 3.9889 1.0599 1.0683 1.0788 1.1036 1.1520 1.2095 1.2710 4.2820 1.3026 1.9008 1.5777 1.8293 4.0582 1.5289 2.8602 3.5021 1.3525 2.4712 2.2625 2.8657 1.2593 2.6313 2.3794 2.0647 2.1628 2.5075 2.7701 2.5332 1.9365 1.6307 1.3155 1.4991 1.3679 1.3569 1.4035 1.3219 1.3476 1.2895 1.2399 1.0986 1.0437 1.2239 1.1500 1.2391 1.1438 1.1758 1.3569 1.3928 1.4642 1.5997 1.6998 1.6432 1.6267 1.3893 1.2178 1.0781 1.0743 1.0752 1.0699 1.0687 1.0702 1.0832 1.0833 1.0441 1.0861 1.0905 1.0941 1.0950 1.1644 5.7634 1.0587 1.0587 1.0588 1.0592 1.0593 1.0596 1.0597 1.0607 1.0619 1.0587 1.0364 1.0615 1.0961 1.0967 1.0980 1.0999 1.1021 1.1033 1.1002 1.0955 1.1006 1.0967 1.1038 1.1024 1.1006 1.0993 1.0453 1.0640 1.0965
irintensity: 0.0546 0.1325 0.0027 0.8525 0.4497 0.0327 0.0277 0.1345 0.0176 0.1736 0.0468 0.0396 0.1701 0.1504 0.0424 0.0741 0.5522 41.3500 0.0502 1.0292 14.8600 1.0307 1.3523 17.7439 9.0783 1.6233 6.9529 1.4738 8.6630 106.8013 40.6069 238.0385 32.9837 15.7262 1.4581 9.3805 0.9414 5.0457 0.3240 3.0105 16.7925 0.0798 4.8842 0.1232 6.2769 0.4779 0.5978 3.4784 9.9741 2.2458 195.3694 35.9253 0.1674 2.3465 0.4306 0.1401 0.0277 0.0657 0.7475 24.6800 12.6943 0.1046 4.8223 29.1862 0.2891 1.0403 0.9775 0.4405 4.7640 0.4914 4.9356 2.7983 2.0283 0.4241 2.7898 2.4358 6.0210 1.9933 2.2723 1.9653 0.0350 0.7046 0.8585 0.2871 0.1161 0.4166 4.5768 11.1878 1.8345 0.0063 0.8475 0.0518 0.3724 0.0862 0.4637 1.3790 11.7498 1.1766 1.4688 3.6106 42.9354 9.4348 271.1211 0.8089 0.0111 1.0813 0.3190 0.9611 3.4729 0.7517 40.6339 63.3824 207.1717 38.8997 69.2944 0.6466 1.3636 2.3769 2.0738 1.8897 1.2636 7.0346 6.4729 4.4358 26.6855 216.4137 115.5118 100.0709 56.1854 1.1369 11.5005 3.3226
temp: 298.150 k
press: 1.00000 atm
elementType: 8 8 7 6 6 6 6 6 6 6 6 6 6 6 6 6 6 1 1 1 1 1 1 1 1 1 1 1 1 1 1 1 1 1 1 1 1 1 1 1 1 1 1 1 1 1
symmnumber: 1
zpe: 1079101.5 jmol-1
zpe.correction: 0.411008 hartree
zpe.thermalcorrener: 0.433654 hartree
zpe.thermalcorrenthalpy: 0.434598 hartree
zpe.thermalcorrgfe: 0.353548 hartree
zpe.sumelectzpe: -754.678818 hartree
zpe.sumelectthermal: -754.656172 hartree
zpe.sumelectthermalent: -754.655228 hartree
zpe.sumelectthermalfe: -754.736278 hartree
dipole: -0.0335 -0.5338 -0.8378
dipole: 0.9940
quadrupole: -110.8864 -104.5881 -109.7890
quadrupole: 3.1841 9.3882 0.8587
quadrupole: -2.4653 3.8331 -1.3678 3.1841 9.3882 0.8587
hfenergy: -755.0898259 hartree
pointgroup: C01 [X(C14H29N1O2)]
dipole: 0.0122595 0.1487674 -0.3614668 debye
polarizability: 222.5483071|4.5129281|144.1916504|2.6801113|-2.1957229|140.3810043 unknown
InChI: InChI=1S/C14H29NO2/c1-2-3-4-5-6-7-8-9-10-11-12-13(15)14(16)17/h13,16H,2-12,15H2,1H3
charge 0 multiplicity 1
46 atoms
O  7.053635 1.357124 -1.081224
O  7.62196 0.422164 0.969139
N  5.713317 -1.720656 0.468044
C  -0.793259 0.333411 0.25394
C  -2.09543 -0.329443 -0.249099
C  0.487437 -0.352207 -0.273168
C  -3.37562 0.348856 0.288817
C  1.788553 0.331155 0.205215
C  -4.678688 -0.297157 -0.233461
C  3.065245 -0.371724 -0.307777
C  -5.958286 0.376001 0.31263
C  4.357911 0.34531 0.13379
C  -7.262156 -0.258846 -0.221335
C  5.638474 -0.449948 -0.262958
C  -8.541093 0.41318 0.328919
C  -9.839266 -0.22216 -0.214555
C  6.867368 0.447372 -0.028692
H  -0.787334 1.40197 -0.0479
H  -0.782783 0.325053 1.364129
H  -2.09817 -1.400686 0.042611
H  -2.109882 -0.310642 -1.359172
H  0.466709 -0.362537 -1.38319
H  0.493328 -1.415053 0.046821
H  -3.364194 1.424011 0.011662
H  -3.369071 0.315135 1.39859
H  1.802855 0.353206 1.315185
H  1.786223 1.390986 -0.126614
H  -4.687799 -1.374149 0.036224
H  -4.688199 -0.255674 -1.342973
H  3.036642 -0.419354 -1.416718
H  3.098984 -1.416346 0.055377
H  -5.943738 1.455285 0.052079
H  -5.953754 0.325164 1.421817
H  4.405898 1.353205 -0.321697
H  4.356546 0.483364 1.234822
H  -7.277514 -1.338868 0.03582
H  -7.269707 -0.20443 -1.330338
H  5.584658 -0.661731 -1.346694
H  -8.521859 1.493012 0.075399
H  -8.534861 0.354768 1.436692
H  -9.896757 -1.294688 0.05146
H  -9.884391 -0.148735 -1.317741
H  -10.737783 0.275976 0.194258
H  6.383254 -2.389236 0.073533
H  5.876148 -1.586327 1.473189
H  7.831552 1.945891 -0.87946
