program: Gaussian 09
title: 000252471
version: EM64L-G09RevD.01
frameworkgroup: C1[X(C17H14O6)]
method: RPBEPBE
basis: SDD
operation: Freq
keyword: #pfreq=noraman
keyword: PBEPBE/SDD
title: #p freq=noraman PBEPBE/SDD
converged: YES YES NO NO
title: Mulliken charges:
elementType: O O O O O O C C C C C C C C C C C C C C C C C H H H H H H H H H H H H H H
charge: -0.224959 -0.344290 -0.265259 -0.438704 -0.273159 -0.432419 0.161102 0.243259 0.180799 0.071423 0.141862 0.338811 -0.553853 -0.067344 0.266378 -0.337906 -0.338516 -0.388723 -0.406109 -0.358005 0.285144 -0.519168 -0.498582 0.288458 0.279699 0.279075 0.237917 0.220509 0.250587 0.389650 0.304740 0.212310 0.226779 0.230377 0.228774 0.254134 0.355208
chargesum: 0.00000
title: Mulliken charges with hydrogens summed into heavy atoms:
elementType: O O O O O O C C C C C C C C C C C C C C C C C
charge: -0.224959 -0.344290 -0.265259 -0.049054 -0.273159 -0.077211 0.161102 0.243259 0.180799 0.071423 0.141862 0.338811 -0.265395 -0.067344 0.266378 -0.058207 -0.059442 -0.150806 -0.185600 -0.107418 0.285144 0.224661 0.214703
polarizability: 3.86056722e+02 1.67720863e+01 2.06457229e+02 2.73474284e+00 -1.51520266e+01 1.08663776e+02
1716.lowfreq: -5.6575 -2.8359 -0.0005 -0.0003 0.0009 4.8993 23.0374 31.0101 46.2402
frequency: 22.9809 30.9857 46.2318 56.8407 68.5080 100.3991 115.1529 123.0558 153.1876 155.2169 181.1069 196.5722 217.9198 224.9994 253.9392 257.0283 311.0780 330.5137 338.9362 346.2444 353.1462 366.9589 387.6019 411.8223 417.0551 419.5199 445.3181 470.0819 483.2741 526.2829 528.3639 575.6761 579.6443 603.1638 625.4054 634.9790 639.9332 674.6415 710.7018 727.1660 735.3691 781.8338 790.6893 804.0789 808.7023 830.1615 833.9864 856.1706 869.9334 904.4942 937.0412 948.5772 954.6363 1003.8979 1020.7761 1046.1523 1089.6934 1107.6612 1110.2578 1112.7442 1144.7024 1152.8587 1157.5126 1162.5239 1186.0647 1194.0430 1237.8684 1252.2188 1264.0487 1293.0551 1311.0442 1320.1007 1346.9868 1382.9850 1390.0549 1417.3770 1424.7908 1429.9719 1435.4352 1448.1689 1456.6194 1463.8896 1470.9928 1495.9887 1503.2820 1530.6076 1555.1133 1584.5966 1598.1197 1623.5966 1624.7561 2981.7419 3003.6363 3098.9447 3114.3635 3116.1328 3128.8038 3131.0001 3138.5301 3171.1354 3192.0016 3193.1001 3194.2800 3371.6591 3580.9220
redmass: 5.1454 3.5325 3.7416 5.6116 4.1639 3.8679 4.6650 1.9100 3.7904 1.5126 2.0649 5.6558 5.0227 5.3431 4.5923 4.4588 5.9045 6.0358 5.5856 6.8860 5.3151 1.1180 6.1089 3.1927 5.3917 4.6868 6.9846 5.8098 6.7900 2.9914 8.2142 6.0494 6.6014 4.2554 5.0688 1.4577 4.1493 5.1583 5.1593 4.9999 5.5285 6.0932 6.1472 5.0139 1.4465 1.8231 4.5412 1.5546 1.4256 7.5033 1.3785 7.4252 1.3642 2.9933 7.1897 4.0846 4.2971 1.5152 1.2471 1.2805 1.3452 1.3371 1.4975 1.6980 1.2535 3.3508 3.9280 2.6695 2.1335 2.3468 1.6888 2.4283 2.0334 4.4403 2.9251 3.0705 2.8680 2.1207 1.3960 1.1400 1.0632 1.0590 3.0733 1.0967 2.8479 6.9164 8.6005 6.1727 7.5077 7.2587 6.5649 1.0313 1.0299 1.1015 1.1031 1.0908 1.0894 1.1055 1.1061 1.0952 1.0940 1.0932 1.0939 1.0621 1.0660
irintensity: 1.9278 3.6804 1.9217 1.5093 5.9864 2.8164 0.3970 1.0798 1.7289 0.5284 1.3455 3.0277 2.4791 9.4730 2.8550 0.2187 4.1672 8.0010 14.3011 5.6306 1.3104 143.4859 4.5777 2.3802 3.8396 15.3455 7.6160 5.3720 23.6983 22.2819 7.1675 21.7696 2.8363 8.1842 17.6697 93.9084 18.4665 5.2232 7.3869 6.0521 29.9382 6.1626 9.1682 24.7242 10.6715 51.5559 58.8027 39.5201 14.1730 4.6697 1.6685 28.2846 2.1266 14.2357 67.0932 65.1370 29.5303 124.5179 4.8957 43.5684 290.7615 0.8021 21.5340 84.0988 76.1487 16.9039 394.5353 140.3994 196.3196 30.7558 11.4047 12.0651 22.9445 5.3806 179.3655 162.7081 38.0302 10.4929 30.2995 31.2584 14.4204 43.0876 11.9472 56.2989 140.3946 109.8236 20.1904 26.6537 93.3898 154.7670 215.7354 81.8527 78.8480 28.1209 33.3678 26.5000 9.1953 3.9616 19.4358 7.9483 6.8348 1.5263 1.5897 70.9929 59.3280
temp: 298.150 k
press: 1.00000 atm
elementType: 8 8 8 8 8 8 6 6 6 6 6 6 6 6 6 6 6 6 6 6 6 6 6 1 1 1 1 1 1 1 1 1 1 1 1 1 1
symmnumber: 1
zpe: 717365.3 jmol-1
zpe.correction: 0.273230 hartree
zpe.thermalcorrener: 0.294087 hartree
zpe.thermalcorrenthalpy: 0.295031 hartree
zpe.thermalcorrgfe: 0.222793 hartree
zpe.sumelectzpe: -1105.864158 hartree
zpe.sumelectthermal: -1105.843301 hartree
zpe.sumelectthermalent: -1105.842356 hartree
zpe.sumelectthermalfe: -1105.914595 hartree
dipole: -1.2728 0.9635 -0.0137
dipole: 1.5964
quadrupole: -116.2143 -124.6030 -131.0179
quadrupole: 1.4936 -5.2106 0.5586
quadrupole: 7.7308 -0.6579 -7.0729 1.4936 -5.2106 0.5586
hfenergy: -1106.1373875 hartree
pointgroup: C01 [X(C17H14O6)]
dipole: 0.5014743 -0.3485448 -0.1466948 debye
polarizability: 385.3378814|21.2782552|187.1471543|-6.6144894|41.5014891|128.692691 unknown
InChI: InChI=1S/C17H14O6/c1-21-13-7-12-14(17(22-2)16(13)20)15(19)11(8-23-12)9-3-5-10(18)6-4-9/h3-8,18,20H,1-2H3
charge 0 multiplicity 1
37 atoms
O  0.450638 2.218141 0.786758
O  2.200063 -2.154737 -0.900459
O  5.0996 1.535865 0.288237
O  4.59738 -1.238133 -0.67853
O  -0.683076 -1.467491 -0.823713
O  -6.984815 -0.259301 0.101663
C  1.107149 -0.002857 -0.080805
C  1.448684 1.299982 0.403943
C  -1.316624 0.632993 0.191276
C  -0.318223 -0.368022 -0.278107
C  2.227539 -0.830944 -0.412018
C  -2.77751 0.356381 0.151986
C  2.76021 1.782472 0.505366
C  3.565218 -0.357903 -0.332868
C  3.843568 0.965844 0.121666
C  -0.877242 1.84882 0.667419
C  -3.374809 -0.36542 -0.917429
C  -3.628143 0.835078 1.190553
C  -4.766907 -0.581142 -0.958342
C  -5.019227 0.628612 1.159045
C  -5.591006 -0.07971 0.07764
C  1.511742 -3.206681 -0.107587
C  6.283488 0.994388 -0.415773
H  2.950272 2.795223 0.865749
H  -1.532322 2.665242 0.977565
H  -2.741689 -0.764843 -1.711685
H  -3.192144 1.348932 2.055413
H  -5.205626 -1.139326 -1.795893
H  -5.668887 0.989212 1.961758
H  4.134403 -2.072165 -0.987725
H  0.425068 -3.091464 -0.233917
H  1.805454 -3.133769 0.956339
H  1.864463 -4.156032 -0.539264
H  7.074646 1.731139 -0.210764
H  6.09373 0.923552 -1.500633
H  6.55598 0.002333 -0.025916
H  -7.286344 -0.776066 -0.68635
