program: Gaussian 09
title: 000252467
version: EM64L-G09RevD.01
frameworkgroup: C1[X(C18H20N2)]
method: RPBEPBE
basis: SDD
operation: Freq
keyword: #pfreq=noraman
keyword: PBEPBE/SDD
title: #p freq=noraman PBEPBE/SDD
converged: YES YES NO NO
title: Mulliken charges:
elementType: N N C C C C C C C C C C C C C C C C C C H H H H H H H H H H H H H H H H H H H H
charge: -0.069428 -0.483603 -0.242580 0.345571 0.190726 -0.530151 -0.482687 0.228570 0.011939 0.198921 -0.675785 -0.722236 0.176507 -0.642907 0.215463 -0.818407 -0.397494 -0.381590 -0.258309 -0.217825 0.217307 0.212591 0.228343 0.225253 0.220381 0.243318 0.219690 0.217792 0.234646 0.300871 0.206517 0.220145 0.223430 0.206238 0.242707 0.232065 0.232253 0.230145 0.220856 0.220758
chargesum: 0.00000
title: Mulliken charges with hydrogens summed into heavy atoms:
elementType: N N C C C C C C C C C C C C C C C C C C
charge: -0.069428 -0.182732 -0.025272 0.345571 0.190726 -0.089218 -0.037054 0.228570 0.011939 0.198921 -0.432468 -0.050109 0.176507 0.007186 0.215463 -0.137396 -0.165241 -0.151446 -0.037452 0.002933
polarizability: 3.25584927e+02 1.54876036e+01 2.12375140e+02 -4.40079172e+00 -1.90164139e+00 1.17007460e+02
1716.lowfreq: -44.3838 -6.8093 -0.0003 0.0001 0.0006 6.2783 7.9516 47.0235 63.3871
frequency: -43.9680 46.9105 63.3855 84.6164 111.3638 132.3574 159.9246 183.1094 207.1009 226.7196 243.7063 251.4416 270.5128 303.6427 308.5707 335.9454 355.4749 380.4802 432.1995 440.9660 453.7552 463.5004 465.9331 516.4683 526.7989 547.7687 568.6320 578.8728 593.9953 628.5434 654.7258 698.2561 716.2946 738.0524 751.0202 758.9025 779.4250 806.1884 850.0934 852.5027 874.5092 895.8908 913.0343 918.3622 932.5642 963.3623 970.3393 1000.6035 1014.3054 1022.7411 1033.4714 1052.9786 1063.3979 1076.8357 1081.0249 1107.4536 1118.6518 1126.0654 1153.0617 1171.0823 1202.3980 1205.8624 1215.1243 1231.0108 1251.4137 1266.8813 1277.9018 1288.9707 1318.4457 1330.7519 1334.0763 1348.8792 1361.0608 1378.3496 1388.2951 1398.6521 1415.2522 1427.1388 1431.2749 1443.1768 1451.7955 1454.9434 1463.8153 1467.4465 1471.2275 1477.3383 1481.9941 1484.2096 1489.2784 1491.1302 1586.5506 1591.3132 1623.7374 1639.1006 2884.6691 2954.4989 2967.2726 2981.9185 2986.7184 2992.9770 3006.3765 3014.6174 3043.0099 3054.4808 3070.6202 3077.0627 3083.4841 3094.3492 3115.2282 3123.5972 3131.2791 3144.5581 3163.0199 3618.5317
redmass: 1.0781 3.4846 3.3576 3.5122 3.2110 4.2966 2.4953 2.1760 1.2897 1.3161 2.5916 2.6579 3.0640 2.4716 5.1315 3.8811 3.2139 3.8163 2.9930 3.1216 3.3622 1.1763 3.3214 3.2611 4.7584 4.0395 3.9974 3.7220 5.9836 4.6718 3.5628 3.7372 4.1943 2.5065 1.5634 3.3053 3.1658 4.2027 4.0712 1.4752 1.8869 1.5482 2.6976 4.9555 1.4014 1.9616 1.3076 2.0728 2.0461 1.7626 1.6157 2.2817 2.0903 2.2529 2.1948 1.8585 1.5371 1.7972 1.9655 1.2548 1.4206 1.7720 1.9117 1.6140 2.6997 2.5951 1.6153 1.5944 1.7238 2.5951 1.8101 1.3425 1.5556 1.2275 3.1775 1.2286 3.7177 2.3007 1.2931 2.0122 1.4005 1.0730 1.0537 1.0786 1.3997 1.5563 1.7420 1.3509 1.6506 1.1067 6.9171 7.7838 6.7078 7.9604 1.0529 1.0615 1.0398 1.0843 1.0365 1.0709 1.0845 1.0767 1.0956 1.1041 1.1007 1.0963 1.0988 1.1009 1.0910 1.0850 1.0891 1.0951 1.1001 1.0797
irintensity: 0.3076 0.0508 0.1969 3.2706 0.1903 0.3051 0.0890 2.5484 0.6347 0.0341 0.1282 0.2548 0.2119 0.0848 0.4263 1.8734 0.2885 0.5872 3.8396 8.5521 3.8816 89.5758 9.2501 5.2092 1.5137 4.0459 1.9943 0.5805 10.7054 6.9943 7.5961 13.1622 4.4722 26.5132 66.0205 1.9473 16.8992 1.3507 0.9012 0.0160 4.3202 13.7287 3.7199 0.5947 2.0659 1.4456 0.0112 4.2580 9.5163 13.4323 4.9769 6.3865 7.5094 20.3858 9.6168 13.2356 17.3633 6.3401 30.1862 5.6626 15.2034 4.3686 4.2851 3.0849 59.7165 7.7764 10.4254 6.2966 25.4794 4.8299 87.5178 3.3430 19.5597 18.9273 8.5924 13.4461 6.7352 8.3031 22.0236 29.2947 5.6793 4.6424 16.0072 9.1162 30.8203 25.0041 7.5016 1.2862 33.1591 1.7166 4.0425 3.3740 44.4244 4.5613 85.9628 36.6822 46.2254 23.3639 20.6869 38.0086 70.5609 69.8609 25.5118 38.2697 29.9851 21.8005 31.7485 45.2792 10.4608 2.0898 2.7315 34.1275 38.8965 40.0943
temp: 298.150 k
press: 1.00000 atm
elementType: 7 7 6 6 6 6 6 6 6 6 6 6 6 6 6 6 6 6 6 6 1 1 1 1 1 1 1 1 1 1 1 1 1 1 1 1 1 1 1 1
symmnumber: 1
zpe: 880301.7 jmol-1
zpe.correction: 0.335289 hartree
zpe.thermalcorrener: 0.352024 hartree
zpe.thermalcorrenthalpy: 0.352968 hartree
zpe.thermalcorrgfe: 0.292015 hartree
zpe.sumelectzpe: -806.006084 hartree
zpe.sumelectthermal: -805.989349 hartree
zpe.sumelectthermalent: -805.988405 hartree
zpe.sumelectthermalfe: -806.049358 hartree
dipole: -0.1597 2.7310 0.3467
dipole: 2.7575
quadrupole: -116.6620 -103.6491 -123.3013
quadrupole: 0.4392 1.3218 -1.3894
quadrupole: -2.1246 10.8884 -8.7638 0.4392 1.3218 -1.3894
hfenergy: -806.3413728 hartree
pointgroup: C01 [X(C18H20N2)]
dipole: -0.0788348 1.0598299 0.218041 debye
polarizability: 324.2328941|18.5353219|212.9237463|-11.3593187|4.3074187|117.810887 unknown
InChI: InChI=1S/C18H20N2/c1-11-13-8-9-20(3)12(2)15(13)10-16-14-6-4-5-7-17(14)19-18(11)16/h4-7,10,12,19H,8-9H2,1-3H3
charge 0 multiplicity 1
40 atoms
N  4.122248 -0.818764 0.13787
N  -1.989888 1.529028 0.150695
C  2.865923 -1.49344 -0.295782
C  1.612388 -0.60383 -0.156393
C  1.718723 0.827906 -0.124337
C  3.097249 1.490919 -0.125688
C  4.247618 0.515041 -0.496057
C  0.550438 1.640801 -0.025201
C  -0.69688 0.977742 0.037519
C  -0.82106 -0.451541 0.011618
C  0.349801 -1.230674 -0.084244
C  3.00628 -2.043845 -1.739027
C  -2.243288 -0.762267 0.111897
C  4.283078 -0.784802 1.608964
C  -2.9395 0.494526 0.195737
C  0.611428 3.157532 0.049815
C  -2.98502 -1.966335 0.138812
C  -4.344051 0.565379 0.305886
C  -4.391075 -1.904737 0.249028
C  -5.060783 -0.651547 0.331426
H  2.73742 -2.369487 0.371435
H  3.119318 2.345545 -0.830849
H  3.285492 1.925248 0.878691
H  4.269865 0.370224 -1.591605
H  5.221346 0.954009 -0.209098
H  0.287812 -2.326165 -0.095686
H  2.119934 -2.644581 -2.010687
H  3.089231 -1.22955 -2.480553
H  3.907457 -2.677509 -1.80785
H  -2.203832 2.520984 0.209381
H  3.468188 -0.250702 2.154673
H  5.242013 -0.29381 1.856735
H  4.322805 -1.81963 1.994708
H  -0.316547 3.625092 -0.328415
H  0.7598 3.509656 1.0902
H  1.442026 3.567887 -0.549027
H  -2.477624 -2.935582 0.075876
H  -4.868013 1.525558 0.369743
H  -4.977024 -2.829971 0.271641
H  -6.153199 -0.629708 0.416052
