program: Gaussian 09
title: 000260833
version: EM64L-G09RevD.01
frameworkgroup: C1[X(C12H14N6O3S)]
method: RPBEPBE
basis: SDD
operation: Freq
keyword: #p
keyword: freq=noraman
keyword: PBEPBE/SDD
title: #p freq=noraman PBEPBE/SDD
converged: YES YES NO NO
title: Mulliken charges:
elementType: S O O O N N N N N N C C C C C C C C C C C C H H H H H H H H H H H H H H
charge: 0.940465 -0.251617 -0.547798 -0.541452 -0.170847 -0.372193 -0.439265 -0.034845 -0.622917 -0.710465 -0.553325 -0.472480 0.086692 0.285614 0.514422 -0.348147 -0.374537 -0.032778 -0.076717 -0.247160 -0.235155 0.149603 0.273689 0.265203 0.276439 0.239016 0.304679 0.262270 0.232540 0.311425 0.285291 0.276905 0.356266 0.310870 0.336835 0.323475
chargesum: 0.00000
title: Mulliken charges with hydrogens summed into heavy atoms:
elementType: S O O O N N N N N N C C C C C C C C C C C C
charge: 0.940465 -0.251617 -0.547798 -0.541452 -0.170847 -0.067514 -0.127841 -0.034845 0.044219 -0.050155 -0.014432 0.042975 0.086692 0.285614 0.514422 -0.085877 -0.141997 -0.032778 -0.076717 0.038132 0.041750 0.149603
polarizability: 2.80399029e+02 -6.52795116e+00 1.82491454e+02 3.63650030e+00 -1.34259190e+01 1.86312782e+02
1716.lowfreq: -6.8863 -3.3763 -0.0017 -0.0016 -0.0011 7.9193 14.8732 19.5521 41.0090
frequency: 14.2754 19.5322 40.9866 54.2144 66.7214 92.1540 114.3157 123.8658 175.1892 177.9034 205.5258 218.9333 225.9613 242.5756 257.6015 267.8086 285.4977 298.6340 323.6653 349.5132 367.6925 387.5638 402.9084 414.4916 442.4610 459.6274 469.3410 483.6567 508.0809 514.3674 528.0834 536.4868 548.8955 561.2714 588.0130 609.3378 619.7145 663.3616 671.6721 691.6911 726.0918 746.8042 752.0803 797.6855 797.7939 809.6809 821.1083 843.4255 908.2607 909.6638 928.0035 956.6231 966.8135 973.9514 981.3409 994.0915 1006.6641 1060.0224 1066.8100 1073.5276 1096.0159 1134.6897 1150.6496 1186.9365 1194.5776 1199.8910 1232.7311 1254.8219 1280.9160 1302.2458 1324.3301 1353.1345 1372.1168 1376.0214 1385.4924 1420.9231 1435.2058 1460.4094 1467.2257 1486.9922 1491.4422 1532.3774 1561.0363 1579.9682 1589.1862 1600.6649 1632.4568 1669.9735 2988.4173 3040.4037 3094.3562 3131.6510 3146.5158 3153.1740 3167.1119 3177.6979 3358.0651 3482.0454 3525.9489 3532.0864 3546.4237 3696.7952
redmass: 7.3307 7.2444 8.4310 3.4939 6.0901 4.9039 6.5399 1.7810 7.5648 3.3748 7.0295 4.9966 5.9011 4.2798 2.9713 1.2462 3.8370 4.3026 3.4775 5.1625 5.0766 4.0541 4.3316 3.1772 3.2691 3.8138 4.2962 3.7957 1.4258 1.6453 3.1209 4.6148 1.2036 4.4896 4.8066 6.7325 7.1490 5.4862 4.6189 7.9405 3.4348 5.5532 5.9264 4.1823 3.1286 2.3548 1.3152 1.7112 4.1067 4.3382 3.0712 1.4044 1.9680 1.3939 4.0960 2.3137 4.0819 2.6498 1.4984 2.1222 3.8909 1.4248 2.9046 2.4764 1.3607 1.5063 2.3879 1.5189 1.5705 1.2884 1.6728 1.4647 2.7654 3.2841 1.5876 3.9797 3.1722 2.4449 1.2390 1.6971 1.4548 1.0871 8.0099 7.3394 1.8069 4.5968 2.2764 6.3762 1.0715 1.0660 1.0910 1.1011 1.0878 1.0895 1.0965 1.0951 1.0414 1.0762 1.0997 1.0766 1.0464 1.1047
irintensity: 1.5495 3.4336 14.1778 0.6614 0.4026 1.4642 0.3730 32.8755 3.0177 8.3936 4.4757 1.2113 5.8331 25.1111 5.6251 54.8260 6.2323 20.3910 19.2370 5.1610 16.5769 26.9578 19.7166 24.0993 43.6802 18.1314 131.5878 36.9329 150.8226 270.6523 127.6213 15.1469 83.4221 17.4274 58.5175 7.5982 1.8724 28.2760 4.3728 13.0622 0.9876 1.5332 48.7632 43.0875 23.1232 178.4807 12.5306 49.5592 43.9530 68.7472 112.0227 1.0911 13.9792 0.9220 8.8057 23.4856 101.7118 61.7065 44.6594 8.2815 24.0093 20.9755 2.3489 71.8345 20.3877 31.1449 36.9641 58.7382 50.9285 1.0540 51.4349 100.0201 44.6921 5.5014 24.6696 1.7089 66.5957 212.5929 88.1440 94.4345 65.7611 18.3586 518.0201 5.4750 106.6957 201.8052 365.3378 355.7315 24.8472 45.8515 5.4875 10.4506 8.8179 1.1592 6.7660 8.6957 24.6958 5.7650 20.7719 23.0624 101.9453 42.8924
temp: 298.150 k
press: 1.00000 atm
elementType: 16 8 8 8 7 7 7 7 7 7 6 6 6 6 6 6 6 6 6 6 6 6 1 1 1 1 1 1 1 1 1 1 1 1 1 1
symmnumber: 1
zpe: 699559.2 jmol-1
zpe.correction: 0.266448 hartree
zpe.thermalcorrener: 0.287309 hartree
zpe.thermalcorrenthalpy: 0.288253 hartree
zpe.thermalcorrgfe: 0.215099 hartree
zpe.sumelectzpe: -1416.138623 hartree
zpe.sumelectthermal: -1416.117762 hartree
zpe.sumelectthermalent: -1416.116818 hartree
zpe.sumelectthermalfe: -1416.189972 hartree
dipole: 3.3702 4.4063 -6.1176
dipole: 8.2583
quadrupole: -140.3280 -134.6766 -136.0700
quadrupole: -6.7350 -52.3618 3.1052
quadrupole: -3.3031 2.3482 0.9549 -6.7350 -52.3618 3.1052
hfenergy: -1416.4050706 hartree
pointgroup: C01 [X(C12H14N6O3S1)]
dipole: 1.4038205 -2.911284 0.331702 debye
polarizability: 279.517569|8.0171831|198.0331858|-8.8588699|-2.6531288|171.65251 unknown
InChI: InChI=1S/C12H14N6O3S/c13-12-16-10-9(11(19)17-12)5-18(6-15-10)7-1-3-8(4-2-7)22(14,20)21/h1-4,15-16H,5-6,13-14H2
charge 0 multiplicity 1
36 atoms
S  -4.746898 0.252925 1.297794
O  3.240562 2.418981 -1.513086
O  -5.282684 -1.163546 1.900691
O  -4.502772 1.572208 2.225112
N  0.405445 -0.840785 -1.76765
N  1.943973 -2.098756 -0.324408
N  3.612554 -0.879702 0.884461
N  4.262506 1.376859 0.33462
N  5.272344 0.262099 2.130199
N  -5.978283 0.669251 -0.015558
C  1.411988 0.223947 -2.017826
C  1.099753 -2.128682 -1.552675
C  2.495586 0.211561 -0.950869
C  2.65848 -0.90019 -0.146116
C  -0.777885 -0.564932 -1.038739
C  -1.018737 0.705553 -0.431774
C  -1.785581 -1.574693 -0.922718
C  3.349212 1.399921 -0.761022
C  -3.176553 -0.062736 0.343841
C  -2.220432 0.96128 0.255732
C  -2.983233 -1.331135 -0.231133
C  4.365843 0.292509 1.085924
H  0.941979 1.21739 -2.072918
H  1.853999 0.053092 -3.01899
H  1.760117 -2.304312 -2.418642
H  0.39735 -2.968506 -1.4687
H  1.534191 -2.52301 0.515073
H  -0.259911 1.491066 -0.465119
H  -1.652751 -2.543514 -1.414338
H  3.885075 -1.763554 1.319392
H  -2.39419 1.923174 0.7491
H  -3.75096 -2.105561 -0.137959
H  5.833367 1.102295 2.254601
H  5.251808 -0.439663 2.865799
H  -6.853043 0.172647 0.226277
H  -6.095218 1.696216 -0.047771
