program: Gaussian 09
title: 000260808
version: EM64L-G09RevD.01
frameworkgroup: C1[X(C18H20N2O)]
method: RPBEPBE
basis: SDD
operation: Freq
keyword: #p
keyword: freq=noraman
keyword: PBEPBE/SDD
title: #p freq=noraman PBEPBE/SDD
converged: YES YES NO NO
title: Mulliken charges:
elementType: O N N C C C C C C C C C C C C C C C C C C H H H H H H H H H H H H H H H H H H H H
charge: -0.289576 -0.416248 -0.086435 0.419071 0.078339 0.264263 -0.509004 -0.463630 -0.382802 -0.506733 0.389002 -0.404749 -0.627242 -0.614890 -0.391500 0.403542 -0.403342 -0.397814 -0.227052 -0.218365 -0.241345 0.221025 0.183035 0.268735 0.300363 0.267073 0.249129 0.242762 0.180211 0.219650 0.254766 0.224834 0.183570 0.224409 0.217258 0.217757 0.224939 0.268839 0.224974 0.225643 0.227540
chargesum: 0.00000
title: Mulliken charges with hydrogens summed into heavy atoms:
elementType: O N N C C C C C C C C C C C C C C C C C C
charge: -0.289576 -0.115885 -0.086435 0.419071 0.078339 0.264263 -0.104945 -0.194895 -0.115729 -0.257605 0.389002 -0.161987 0.027384 0.017923 0.043515 0.403542 -0.178402 -0.128975 -0.002078 0.007278 -0.013804
polarizability: 3.24148374e+02 1.12657923e+01 2.13538200e+02 -1.13187086e+00 6.53446639e+00 1.12846342e+02
1716.lowfreq: -7.9064 -6.3237 -0.0006 -0.0001 0.0004 3.6986 8.2779 23.1781 41.5848
frequency: 5.8696 23.1453 41.5629 53.3970 61.0631 77.9199 98.8492 139.0821 154.9186 199.4346 209.6706 227.2798 244.3374 249.0724 289.5800 299.3511 322.5327 342.1573 369.9472 402.0055 409.9743 431.5150 453.7771 467.0331 488.1309 494.9523 501.8280 585.0462 605.8700 616.8088 620.7372 631.0431 702.0216 714.7128 741.1785 751.0189 755.8344 778.5499 812.5976 813.9336 817.6663 826.9448 831.6214 855.2462 911.3630 935.3308 964.3660 974.7091 978.7894 989.8701 993.2660 995.7064 1016.9006 1018.6733 1027.6857 1036.5220 1066.3079 1083.9197 1089.5681 1092.8249 1130.7060 1139.1570 1157.3382 1171.6195 1172.2666 1185.4679 1205.9399 1221.3744 1229.2791 1245.3451 1261.1040 1269.4076 1297.8127 1314.1106 1335.0074 1357.5141 1364.7596 1390.3536 1391.8712 1404.8429 1416.8502 1439.4164 1439.6701 1458.7797 1460.5446 1464.3417 1474.5450 1475.0977 1475.7003 1486.2525 1486.4548 1494.5213 1567.2515 1586.2703 1595.8792 1618.8997 1637.4369 2818.3924 2837.9740 2854.5540 2922.2625 2978.0749 2980.5532 3015.6089 3027.7332 3075.9691 3091.4257 3110.7993 3126.8450 3140.6483 3152.5061 3156.0291 3158.6584 3173.8401 3174.5040 3220.1884 3614.6118
redmass: 3.8081 5.1564 4.2967 3.3433 3.4860 3.4659 3.7432 5.0647 5.2110 2.7589 3.3361 2.9968 1.1117 1.2585 4.5044 3.8293 2.7306 2.3489 4.8894 2.8395 3.5769 2.8672 2.8322 2.9951 5.4471 4.4066 1.1978 5.2052 3.2946 6.3557 4.0233 4.1871 2.2584 3.6332 1.4785 4.7656 3.4088 1.5567 4.3629 2.3812 2.0924 3.0153 2.3321 1.2511 1.3314 3.7546 1.3361 1.7896 1.3782 6.1687 4.2683 1.3639 2.3541 1.7528 2.1254 1.5258 3.1620 1.5799 1.5661 1.2908 1.3346 1.4160 2.0466 1.0540 1.9151 1.1106 1.2274 1.9324 1.9260 1.9617 2.6482 1.6549 2.1271 1.4614 1.9431 1.7273 1.4893 4.3524 5.2749 3.1423 1.1432 1.2754 1.8873 1.0520 1.0730 1.9932 1.5920 1.1038 1.0707 2.0449 1.1072 3.1423 6.6396 6.9569 6.2166 6.0636 6.9625 1.0705 1.0579 1.0579 1.0572 1.1022 1.0855 1.0709 1.0721 1.1011 1.1000 1.0876 1.0867 1.0929 1.0876 1.0912 1.0981 1.0973 1.0968 1.0982 1.0808
irintensity: 0.6030 0.6407 0.6696 0.0846 1.9744 0.7002 0.5693 0.5015 1.5263 0.2282 0.0827 10.3639 1.6128 1.4301 3.3556 7.8150 3.1218 5.0694 3.2430 0.8113 3.8999 7.7698 4.7009 7.1929 1.8692 0.9959 105.3100 0.4732 6.7707 0.1443 4.8127 7.6255 29.3671 10.6393 58.6447 2.6048 6.6328 39.4921 6.2146 28.9935 41.6860 19.1664 41.7079 0.2679 3.4217 15.2674 0.2746 11.4523 0.1083 0.0949 113.3107 1.8054 53.7418 1.0633 10.2975 16.2657 14.6205 3.1873 60.3808 8.7910 8.1262 3.2190 233.8393 0.2517 4.5196 3.1575 3.0449 5.8710 23.7228 8.8642 13.6590 50.2285 93.6740 2.7097 75.3216 6.0139 18.5510 6.9424 14.8435 0.3742 4.8365 14.8602 4.7234 16.9506 3.3805 91.4024 4.8177 10.3689 15.9897 8.3210 10.0382 48.7072 51.3186 7.1117 1.3440 12.7787 105.8022 65.8668 81.2166 292.7387 27.8090 32.9746 32.3579 40.7715 33.7868 33.3097 32.8231 10.9567 0.8805 31.5232 2.7179 15.2006 36.6482 6.9277 7.9782 0.9188 50.0218
temp: 298.150 k
press: 1.00000 atm
elementType: 8 7 7 6 6 6 6 6 6 6 6 6 6 6 6 6 6 6 6 6 6 1 1 1 1 1 1 1 1 1 1 1 1 1 1 1 1 1 1 1 1
symmnumber: 1
zpe: 886130.1 jmol-1
zpe.correction: 0.337509 hartree
zpe.thermalcorrener: 0.356836 hartree
zpe.thermalcorrenthalpy: 0.357780 hartree
zpe.thermalcorrgfe: 0.286638 hartree
zpe.sumelectzpe: -881.102183 hartree
zpe.sumelectthermal: -881.082856 hartree
zpe.sumelectthermalent: -881.081911 hartree
zpe.sumelectthermalfe: -881.153054 hartree
dipole: 0.8711 3.2152 1.0258
dipole: 3.4855
quadrupole: -105.9118 -105.3245 -130.4485
quadrupole: -0.4362 -0.4193 2.1948
quadrupole: 7.9831 8.5704 -16.5536 -0.4362 -0.4193 2.1948
hfenergy: -881.4396917 hartree
pointgroup: C01 [X(C18H20N2O1)]
dipole: 0.3342272 1.3256502 -0.1067514 debye
polarizability: 323.9902236|10.6587297|203.7923768|-5.6776042|-30.7123739|122.7503155 unknown
InChI: InChI=1S/C18H20N2O/c1-20(2)12-15-11-19-18-10-16(8-9-17(15)18)21-13-14-6-4-3-5-7-14/h3-11,19H,12-13H2,1-2H3
charge 0 multiplicity 1
41 atoms
O  -1.737798 -0.408264 -0.106971
N  2.314139 2.488727 -0.741294
N  5.205597 -0.983561 0.556266
C  3.789224 0.74866 -0.564823
C  2.436658 0.233368 -0.419279
C  1.534337 1.345414 -0.534618
C  5.068315 -0.048478 -0.593479
C  3.672951 2.124491 -0.754227
C  1.895775 -1.061965 -0.192064
C  0.127948 1.211829 -0.443622
C  -0.367706 -0.092317 -0.224539
C  0.505247 -1.216622 -0.099805
C  5.234637 -0.292129 1.860021
C  6.353572 -1.894104 0.382962
C  -2.696018 0.694894 -0.202273
C  -4.096841 0.153724 0.02048
C  -5.209547 0.909754 -0.42599
C  -4.31877 -1.068838 0.698302
C  -6.526363 0.458539 -0.187071
C  -5.636696 -1.52351 0.931431
C  -6.744467 -0.761496 0.494376
H  5.101645 -0.670648 -1.511085
H  5.938355 0.658913 -0.655787
H  4.452241 2.869749 -0.904067
H  1.958245 3.434253 -0.857963
H  2.569135 -1.915436 -0.071185
H  -0.532037 2.078544 -0.541345
H  0.051108 -2.196842 0.074156
H  6.130013 0.371016 1.984803
H  5.244649 -1.039326 2.673604
H  4.330146 0.328922 1.969762
H  6.373578 -2.627618 1.208589
H  7.343339 -1.367119 0.36943
H  6.251027 -2.44874 -0.567405
H  -2.620431 1.179841 -1.198756
H  -2.450579 1.458674 0.569082
H  -5.049315 1.852701 -0.96498
H  -3.45625 -1.657071 1.023745
H  -7.378165 1.05203 -0.537913
H  -5.79798 -2.47359 1.453443
H  -7.765218 -1.115673 0.676992
