program: Gaussian 09
title: 000260791
version: EM64L-G09RevD.01
frameworkgroup: C1[X(C11H15Cl3N2)]
method: RPBEPBE
basis: SDD
operation: Freq
keyword: #p
keyword: freq=noraman
keyword: PBEPBE/SDD
title: #p freq=noraman PBEPBE/SDD
converged: YES YES NO NO
title: Mulliken charges:
elementType: Cl Cl Cl N N C C C C C C C C C C C H H H H H H H H H H H H H H H
charge: 0.018774 0.018939 0.049325 0.161068 0.160795 -0.365124 -0.377752 -0.390252 -0.353128 -0.512414 -0.356060 0.627079 -0.694939 -0.366200 -0.364509 -0.376049 0.199697 0.199258 0.195006 0.195056 0.223734 0.223757 0.189457 0.189740 0.237762 0.237059 0.196289 0.196070 0.210110 0.210175 0.217278
chargesum: 0.00000
title: Mulliken charges with hydrogens summed into heavy atoms:
elementType: Cl Cl Cl N N C C C C C C C C C C C
charge: 0.018774 0.018939 0.049325 0.161068 0.160795 0.033830 0.012310 0.057240 0.026068 -0.037594 0.036299 0.627079 -0.057377 -0.366200 -0.364509 -0.376049
polarizability: 2.25774756e+02 9.11527931e-02 1.65667867e+02 -2.51687714e+01 1.72019711e-02 1.07694817e+02
1716.lowfreq: -24.6535 -3.9240 -2.0290 0.0003 0.0019 0.0020 14.7798 19.0352 24.8105
frequency: -11.7291 17.3162 24.7974 47.3228 62.4729 88.5653 105.8047 111.9455 140.0360 143.5998 187.3372 191.8775 194.9176 219.5541 236.6451 264.5253 300.3549 345.3585 374.3517 383.8530 409.4668 463.1787 477.4358 518.5034 572.3699 642.3287 708.4110 718.5535 722.5204 735.8250 763.7392 771.5199 802.8001 824.8072 889.1589 907.8193 982.3093 992.7122 1022.4242 1035.7618 1072.9185 1073.8651 1080.9529 1091.0693 1116.4844 1187.2812 1190.2954 1220.2597 1222.4680 1246.2330 1262.6553 1266.7079 1281.4614 1283.6634 1294.4132 1297.7449 1302.0873 1329.3699 1333.7104 1349.9025 1353.0998 1389.8864 1440.4904 1457.8867 1460.0215 1462.7077 1467.3542 1475.0087 1478.4448 1482.2329 1488.0308 1525.7370 2951.7790 2953.4640 2960.2320 2967.8042 2972.4128 2980.8782 2986.8012 2998.0180 3008.3698 3015.0034 3032.2114 3045.0948 3068.7990 3071.9608 3075.1855
redmass: 1.8296 4.2211 9.9228 3.7894 5.1305 1.7157 5.6254 2.3572 1.9445 11.5646 5.5491 26.8819 14.6164 8.3467 1.0999 4.1999 2.8874 29.2795 6.0778 3.5690 13.8594 4.0791 4.5244 5.6252 12.3898 9.3696 7.1531 1.3190 1.2689 1.7414 1.3604 11.2805 10.9606 1.2671 1.8928 1.2616 5.3671 1.1910 3.3146 3.8717 5.1866 2.8595 2.1990 1.4358 2.4491 1.8287 11.5048 1.3394 1.8029 2.9353 2.0651 1.3023 1.0721 1.6389 1.0802 1.3064 1.3329 2.0648 2.8725 1.5278 1.6732 1.2160 7.2867 1.0933 1.0716 1.0754 1.0834 1.0817 1.0427 1.0844 1.0879 10.3427 1.0586 1.0586 1.0590 1.0589 1.0362 1.0585 1.0971 1.0999 1.0589 1.1029 1.1041 1.1041 1.1007 1.0993 1.1038
irintensity: 0.0004 0.1243 0.0682 0.0260 0.5514 0.0159 0.3970 0.0507 0.0169 0.0792 0.6130 0.0420 0.0049 0.1354 0.0017 0.3146 1.0766 0.9059 6.0118 0.0498 6.8751 5.1687 3.2578 0.1290 0.0085 1.8999 35.6918 2.0248 35.9764 37.1879 38.4604 23.6938 77.8756 6.3893 4.7742 12.6547 4.1567 4.1038 1.4853 5.6046 27.0690 1.1522 0.4280 51.3844 28.9194 4.3414 49.8888 18.7362 20.6913 14.1641 0.0482 1.5751 0.8868 0.7675 0.1934 2.8687 13.2994 150.2914 217.9219 4.2209 0.2132 11.2715 311.1827 6.3457 0.0408 3.0572 5.5921 3.5949 12.5610 8.8567 26.4928 186.2068 1.2136 0.2767 17.8906 105.6367 39.5472 33.2357 0.1659 0.4955 23.5963 0.0210 29.2912 71.2533 85.6326 52.5147 21.9659
temp: 298.150 k
press: 1.00000 atm
elementType: 17 17 17 7 7 6 6 6 6 6 6 6 6 6 6 6 1 1 1 1 1 1 1 1 1 1 1 1 1 1 1
symmnumber: 1
zpe: 630879.0 jmol-1
zpe.correction: 0.240289 hartree
zpe.thermalcorrener: 0.257455 hartree
zpe.thermalcorrenthalpy: 0.258400 hartree
zpe.thermalcorrgfe: 0.191829 hartree
zpe.sumelectzpe: -1916.616039 hartree
zpe.sumelectthermal: -1916.598873 hartree
zpe.sumelectthermalent: -1916.597929 hartree
zpe.sumelectthermalfe: -1916.664500 hartree
dipole: 3.9379 0.0007 -1.0662
dipole: 4.0797
quadrupole: -128.3789 -124.3464 -116.0147
quadrupole: -0.0325 2.5450 0.0365
quadrupole: -5.4656 -1.4331 6.8986 -0.0325 2.5450 0.0365
hfenergy: -1916.8563284 hartree
pointgroup: C01 [X(C11H15Cl3N2)]
dipole: 1.5392234 0.0003114 0.4549888 debye
polarizability: 224.5546237|-0.0677263|165.6678216|27.8578159|0.0134322|108.9149951 unknown
InChI: InChI=1S/C11H15Cl3N2/c1-2-3-4-5-6-7-8-9(12)15-11(14)16-10(8)13/h2-7H2,1H3
charge 0 multiplicity 1
31 atoms
Cl -1.48511 -2.80443 0.547303
Cl -1.482819 2.798736 0.560497
Cl -5.682579 0.002933 -1.256098
N  -3.472826 -1.203764 -0.300667
N  -3.47167 1.203726 -0.295669
C  2.401271 -0.015793 0.634568
C  3.506227 0.027497 -0.444488
C  0.977926 0.01094 0.036405
C  4.933686 -0.020304 0.146063
C  -0.117318 -0.004774 1.143658
C  6.041662 0.037954 -0.930001
C  -1.510316 -0.002748 0.56762
C  7.464357 -0.015328 -0.33253
C  -2.240059 -1.181104 0.2380
C  -2.239014 1.177613 0.24307
C  -4.032781 0.000741 -0.540677
H  2.524397 -0.931198 1.249965
H  2.527794 0.845137 1.323672
H  3.371539 -0.823717 -1.144071
H  3.391493 0.950234 -1.05057
H  0.852498 0.917185 -0.587763
H  0.837703 -0.863269 -0.628992
H  5.067795 0.824435 0.854004
H  5.053877 -0.948383 0.743364
H  0.014797 0.881238 1.790454
H  0.019871 -0.904144 1.770439
H  5.923512 0.966775 -1.524668
H  5.905849 -0.804122 -1.639257
H  7.617286 -0.94695 0.244536
H  7.639126 0.835445 0.35295
H  8.237126 0.023242 -1.122119
