program: Gaussian 09
title: 000260773
version: EM64L-G09RevD.01
frameworkgroup: C1[X(C17H9Cl3O2)]
method: RPBEPBE
basis: SDD
operation: Freq
keyword: #p
keyword: freq=noraman
keyword: PBEPBE/SDD
title: #p freq=noraman PBEPBE/SDD
converged: YES YES NO NO
title: Mulliken charges:
elementType: Cl Cl Cl O O C C C C C C C C C C C C C C C C C H H H H H H H H H
charge: -0.030773 -0.005329 -0.034392 -0.327534 -0.189311 0.251176 0.584168 0.407332 -0.407300 -0.369771 -0.402394 -0.346659 -0.285431 -0.243700 -0.228503 0.259293 0.145950 -0.319374 -0.317563 -0.209236 -0.197396 -0.098492 0.260821 0.265906 0.282697 0.236175 0.235776 0.276106 0.281036 0.264191 0.262533
chargesum: 0.00000
title: Mulliken charges with hydrogens summed into heavy atoms:
elementType: Cl Cl Cl O O C C C C C C C C C C C C C C C C C
charge: -0.030773 -0.005329 -0.034392 -0.327534 -0.189311 0.251176 0.584168 0.407332 -0.407300 -0.108951 -0.136489 -0.346659 -0.002733 -0.007524 0.007273 0.259293 0.145950 -0.043269 -0.036528 0.054955 0.065137 -0.098492
polarizability: 3.50577579e+02 7.39644497e+00 2.15477383e+02 1.01229589e+01 -3.44184512e+00 1.30668699e+02
1716.lowfreq: -7.6785 -2.6885 -0.0024 -0.0021 -0.0020 1.7441 15.3588 21.7150 30.5526
frequency: 15.2459 21.5363 30.5376 59.2502 76.5148 92.2015 111.1179 129.2383 151.0108 185.7035 204.4152 224.0282 233.4751 247.4999 295.6993 303.8214 341.8367 348.7141 378.7009 408.8808 419.4490 420.3970 471.7254 499.9551 503.7091 506.6498 553.3048 588.4395 607.1588 621.4871 635.9299 660.5444 684.5589 698.8111 728.9082 738.9756 767.0872 782.7037 805.4163 838.4261 839.5710 851.5589 861.3020 890.1294 913.3288 973.9681 975.5717 979.8492 987.5346 1000.5428 1008.3153 1027.0043 1041.3598 1071.4455 1111.1101 1145.1839 1174.1374 1178.2827 1185.5155 1212.4332 1231.7796 1263.5503 1292.9542 1340.3540 1368.5397 1377.7779 1398.8822 1410.1825 1422.1290 1438.0467 1472.2458 1502.4013 1573.9687 1578.2811 1584.2614 1598.3595 1627.3904 1659.8235 3138.4439 3152.7899 3157.4565 3167.3360 3167.7494 3176.4227 3178.2705 3186.7966 3188.7575
redmass: 10.2935 5.9189 11.4960 7.2666 10.2312 10.8160 8.8306 4.9896 8.5131 17.5755 7.7590 9.2389 6.1518 7.8545 7.7883 10.9812 10.7123 12.6522 9.6373 2.9039 7.0882 3.3232 3.5640 4.1023 7.3744 7.2536 6.0825 4.4199 7.7901 7.0122 4.7192 4.9448 9.3954 6.8484 5.8201 3.9372 3.4652 1.6623 4.2555 6.3935 1.2631 1.5881 1.4280 1.6489 6.6437 1.8436 3.2064 1.3616 1.3669 1.3350 3.7652 3.0470 3.5021 2.9213 1.3405 1.6726 1.1502 1.2822 1.3452 4.3098 3.5853 1.6720 1.2500 3.6201 2.9352 5.2348 4.0983 4.5179 5.3372 2.7006 2.4216 3.9114 8.3448 8.0525 7.8551 6.2269 6.8674 12.6380 1.0860 1.0895 1.0893 1.0950 1.0897 1.1000 1.0970 1.0934 1.0971
irintensity: 0.1003 0.0428 0.0026 0.0482 0.2050 1.7232 0.6170 0.0892 0.0440 1.2829 3.8021 2.9301 0.4752 0.6043 0.2617 3.2966 10.8505 4.6337 9.8559 0.0033 3.7699 7.6540 11.6890 3.8640 20.4965 0.2389 3.7012 1.3140 4.0193 2.1187 2.9482 22.8001 38.8849 3.8264 10.5725 14.2332 42.5691 56.9168 4.7146 32.4207 2.7101 46.4812 18.4622 2.2542 113.2802 122.4545 279.3699 3.6807 0.1592 0.1718 11.1775 69.6067 219.6524 53.8030 7.6249 49.8796 6.4294 178.0759 34.6862 63.0314 316.3330 5.7396 1.6915 43.7319 62.7291 0.1014 17.8979 3.8034 4.8562 25.8674 44.6974 14.7482 8.6453 6.0204 56.2055 127.3737 6.2016 208.3092 3.4939 6.6183 0.0506 9.1063 1.1809 19.9752 2.6320 2.2571 0.7473
temp: 298.150 k
press: 1.00000 atm
elementType: 17 17 17 8 8 6 6 6 6 6 6 6 6 6 6 6 6 6 6 6 6 6 1 1 1 1 1 1 1 1 1
symmnumber: 1
zpe: 547148.9 jmol-1
zpe.correction: 0.208398 hartree
zpe.thermalcorrener: 0.227195 hartree
zpe.thermalcorrenthalpy: 0.228140 hartree
zpe.thermalcorrgfe: 0.157883 hartree
zpe.sumelectzpe: -2182.346771 hartree
zpe.sumelectthermal: -2182.327974 hartree
zpe.sumelectthermalent: -2182.327030 hartree
zpe.sumelectthermalfe: -2182.397286 hartree
dipole: -0.3413 2.4009 -1.0680
dipole: 2.6498
quadrupole: -145.5880 -137.6248 -147.6010
quadrupole: 5.3910 -2.9178 0.1300
quadrupole: -1.9834 5.9798 -3.9964 5.3910 -2.9178 0.1300
hfenergy: -2182.5551691 hartree
pointgroup: C01 [X(C17H9Cl3O2)]
dipole: 0.0816613 0.8339974 0.6201935 debye
polarizability: 350.748443|-3.2167523|209.2862567|11.8107045|21.6650219|136.6889613 unknown
InChI: InChI=1S/C17H9Cl3O2/c18-11-7-5-10(6-8-11)17(21)22-16-13-4-2-1-3-12(13)14(19)9-15(16)20/h1-9H
charge 0 multiplicity 1
31 atoms
Cl -5.596058 -1.395185 -0.32797
Cl -0.36991 -3.176784 -0.35121
Cl 7.053979 0.390369 0.709941
O  0.318543 -0.269939 0.308892
O  0.741823 -0.204582 -2.002831
C  -1.983183 0.574177 0.264308
C  -3.408047 0.327735 0.136103
C  -1.062821 -0.514369 0.100994
C  -3.821249 -1.015374 -0.151329
C  -1.527189 1.901675 0.550633
C  -4.317252 1.42166 0.298712
C  -1.529709 -1.798857 -0.170692
C  -2.921549 -2.065449 -0.304504
C  -2.439556 2.94677 0.702715
C  -3.843068 2.705295 0.57554
C  2.594697 -0.040319 -0.417482
C  1.176655 -0.179508 -0.836636
C  3.571519 0.138249 -1.432582
C  2.990833 -0.090327 0.944618
C  4.932636 0.2705 -1.096785
C  4.350579 0.040317 1.291759
C  5.299739 0.220138 0.264418
H  -0.452513 2.077222 0.652337
H  -5.390436 1.233219 0.201028
H  -3.26461 -3.079249 -0.521521
H  -2.081324 3.958346 0.920533
H  -4.548521 3.533913 0.696783
H  3.249438 0.168608 -2.478408
H  2.235642 -0.23648 1.720729
H  5.692006 0.408121 -1.87131
H  4.668809 0.001111 2.337017
