program: Gaussian 09
title: 000260771
version: EM64L-G09RevD.01
frameworkgroup: C1[X(C15H13ClO2)]
method: RPBEPBE
basis: SDD
operation: Freq
keyword: #p
keyword: freq=noraman
keyword: PBEPBE/SDD
title: #p freq=noraman PBEPBE/SDD
converged: YES YES NO NO
title: Mulliken charges:
elementType: Cl O O C C C C C C C C C C C C C C C H H H H H H H H H H H H H
charge: -0.041204 -0.331152 -0.218365 0.346175 0.265974 0.467763 -0.528704 -0.354296 -0.420916 -0.821302 -0.810934 0.250399 0.140720 -0.326753 -0.323995 -0.209661 -0.199046 -0.097480 0.235718 0.248688 0.235274 0.268453 0.232152 0.225102 0.229224 0.224278 0.234295 0.275739 0.280982 0.262246 0.260628
chargesum: 0.00000
title: Mulliken charges with hydrogens summed into heavy atoms:
elementType: Cl O O C C C C C C C C C C C C C C C
charge: -0.041204 -0.331152 -0.218365 0.346175 0.265974 0.467763 -0.292986 -0.105608 -0.185643 -0.095595 -0.123137 0.250399 0.140720 -0.051014 -0.043013 0.052584 0.061582 -0.097480
polarizability: 2.99509719e+02 -1.34555864e-01 1.43400282e+02 -6.80947931e+00 -4.79377269e+00 1.11960389e+02
1716.lowfreq: -36.5942 -4.7201 0.0003 0.0019 0.0019 2.7437 3.6284 24.5886 33.2493
frequency: -36.4889 24.5605 33.2248 45.8953 76.3782 93.2688 112.9993 141.3114 172.1245 202.5356 220.0257 252.9452 274.3063 296.8774 311.9137 343.8782 381.7166 410.0809 443.0211 456.3396 477.0890 500.3853 521.3376 549.2221 560.4464 622.3134 664.9738 688.3693 706.7115 720.5152 739.3322 755.2219 793.5385 835.1263 839.5384 851.8152 887.8645 924.2221 952.6115 979.4645 980.0638 987.9558 994.6591 1020.6659 1027.1001 1046.2018 1051.7812 1070.3545 1102.8643 1108.8832 1152.1609 1175.8853 1187.8754 1239.0519 1252.2953 1288.4191 1290.6040 1374.4069 1377.4623 1395.7285 1396.7795 1397.4359 1405.1142 1463.9884 1469.9137 1470.5374 1473.4832 1479.2796 1495.4295 1578.4175 1596.8438 1598.1714 1621.0587 1638.2930 2977.8523 2982.4245 3056.2487 3063.7779 3085.9312 3091.4253 3117.2065 3134.2899 3156.9755 3164.2992 3166.7713 3177.8875 3187.1188
redmass: 1.0388 6.0749 4.0105 4.9510 5.6162 9.4974 5.1700 1.1638 4.7928 2.6027 8.2966 6.5219 2.7047 7.3989 4.8312 4.8625 6.4147 2.9088 3.0264 3.4307 3.5549 7.5237 5.8268 4.1078 4.0429 7.1378 4.8524 5.6714 4.4655 5.1527 3.8236 4.5023 3.5715 1.7860 1.2547 1.5928 1.2952 3.1860 1.3632 1.3548 1.5026 1.3652 5.8347 1.5137 4.2313 1.5238 1.5678 2.8140 2.6806 1.4500 1.5237 1.2043 1.6180 3.8211 2.4589 1.7179 1.2704 6.6034 5.5865 1.2822 3.6794 1.3062 2.7913 1.0999 1.7378 1.0607 1.5917 1.2882 1.6385 8.2298 6.3283 6.3604 7.0228 11.5017 1.0373 1.0366 1.0975 1.0976 1.0987 1.0994 1.0914 1.0890 1.0892 1.0963 1.0893 1.0968 1.0972
irintensity: 0.4532 0.1899 0.0556 0.3250 0.0638 2.0613 0.7252 1.1623 1.6353 3.8981 3.5711 0.0153 1.3798 0.3746 2.0757 0.6460 13.9645 0.0019 10.1746 6.6138 7.6065 22.7279 1.8484 2.2148 3.2505 1.7214 21.4338 5.1073 0.3991 8.1472 21.2926 2.0273 2.8625 42.6750 1.6083 48.4522 4.5583 6.2760 0.8810 1.0712 4.5418 0.3586 227.4621 2.5138 160.8560 2.6757 20.7942 78.0918 201.1537 38.4541 55.4132 112.9055 94.4438 292.8782 3.1058 2.4168 2.1474 5.7989 3.3852 9.6501 17.0938 11.9989 1.3550 29.6928 7.5762 10.7765 24.9526 23.8760 102.2750 4.8405 23.4227 83.5733 13.0529 172.4219 41.3830 20.1437 20.4147 9.7641 18.9559 23.3574 20.9396 16.2706 0.0208 7.7564 1.0071 3.0769 1.2753
temp: 298.150 k
press: 1.00000 atm
elementType: 17 8 8 6 6 6 6 6 6 6 6 6 6 6 6 6 6 6 1 1 1 1 1 1 1 1 1 1 1 1 1
symmnumber: 1
zpe: 618677.9 jmol-1
zpe.correction: 0.235642 hartree
zpe.thermalcorrener: 0.251796 hartree
zpe.thermalcorrenthalpy: 0.252741 hartree
zpe.thermalcorrgfe: 0.190054 hartree
zpe.sumelectzpe: -1188.647169 hartree
zpe.sumelectthermal: -1188.631015 hartree
zpe.sumelectthermalent: -1188.630071 hartree
zpe.sumelectthermalfe: -1188.692757 hartree
dipole: 1.4913 -0.5908 1.0804
dipole: 1.9340
quadrupole: -103.2850 -106.8953 -112.8459
quadrupole: -2.4736 3.0722 2.3896
quadrupole: 4.3904 0.7801 -5.1705 -2.4736 3.0722 2.3896
hfenergy: -1188.8828114 hartree
pointgroup: C01 [X(C15H13Cl1O2)]
dipole: -0.5992073 -0.3413259 0.3215404 debye
polarizability: 299.1579878|-7.7914844|111.8866207|6.7184085|3.9946615|143.825782 unknown
InChI: InChI=1S/C15H13ClO2/c1-10-3-8-14(11(2)9-10)18-15(17)12-4-6-13(16)7-5-12/h3-9H,1-2H3
charge 0 multiplicity 1
31 atoms
Cl 6.469934 -0.274821 0.769127
O  -0.303376 -0.088238 0.492138
O  0.106638 0.844452 -1.622659
C  -2.42022 -0.865586 -0.547302
C  -1.73249 -0.002974 0.34275
C  -4.550781 0.120277 0.27673
C  -3.833406 -0.777806 -0.555137
C  -2.405508 0.891407 1.192203
C  -3.81561 0.952696 1.156438
C  -1.68373 -1.836286 -1.447274
C  -6.067774 0.182822 0.220385
C  1.971956 0.188968 -0.191956
C  0.535858 0.36359 -0.55103
C  2.948662 0.615188 -1.129531
C  2.380341 -0.381414 1.041793
C  4.321307 0.477135 -0.844179
C  3.751206 -0.525212 1.338551
C  4.699623 -0.092448 0.389286
H  -4.390738 -1.435418 -1.234714
H  -1.825598 1.526779 1.868789
H  -4.343439 1.651519 1.815201
H  -1.190612 -1.298087 -2.27774
H  -0.895424 -2.381978 -0.896896
H  -2.377183 -2.576052 -1.880987
H  -6.519798 -0.814114 0.377651
H  -6.472572 0.862106 0.989899
H  -6.417239 0.546261 -0.764563
H  2.615873 1.053429 -2.075893
H  1.623097 -0.707637 1.759042
H  5.080401 0.803486 -1.560225
H  4.077503 -0.96334 2.285702
