program: Gaussian 09
title: 000260770
version: EM64L-G09RevD.01
frameworkgroup: C1[X(C15H13ClO2)]
method: RPBEPBE
basis: SDD
operation: Freq
keyword: #p
keyword: freq=noraman
keyword: PBEPBE/SDD
title: #p freq=noraman PBEPBE/SDD
converged: YES YES NO NO
title: Mulliken charges:
elementType: Cl O O C C C C C C C C C C C C C C C H H H H H H H H H H H H H
charge: -0.040942 -0.339805 -0.212477 0.121925 0.389169 0.282224 -0.446559 -0.348226 -0.804798 -0.809127 -0.217017 0.242344 0.134273 -0.322997 -0.320536 -0.211167 -0.200005 -0.097329 0.233322 0.264911 0.255652 0.229249 0.228421 0.225923 0.230160 0.228917 0.229566 0.276138 0.276108 0.262393 0.260292
chargesum: 0.00000
title: Mulliken charges with hydrogens summed into heavy atoms:
elementType: Cl O O C C C C C C C C C C C C C C C
charge: -0.040942 -0.339805 -0.212477 0.121925 0.389169 0.282224 -0.213237 -0.083315 -0.091476 -0.124127 0.012549 0.242344 0.134273 -0.046859 -0.044428 0.051226 0.060287 -0.097329
polarizability: 2.94163821e+02 8.07870537e+00 1.67516827e+02 2.77378729e+00 -5.18671691e+00 9.75268756e+01
1716.lowfreq: -8.3087 -3.6533 -0.0013 0.0014 0.0021 2.9935 15.8382 28.4630 49.2136
frequency: 15.4876 28.3568 49.2022 72.5914 83.2016 91.0768 123.3663 151.0184 168.8472 206.3138 237.8450 254.6694 278.7179 301.2506 302.7093 317.5862 393.1107 409.6170 458.2757 473.4639 498.4853 506.7995 509.8174 546.2943 567.6110 622.3362 660.1136 662.8599 706.7881 725.5462 738.9146 767.7178 798.3901 813.6374 839.0130 851.0324 879.7482 895.4619 969.6130 979.1926 987.4571 987.5941 995.3651 1024.3349 1026.7385 1053.0406 1057.7153 1071.0538 1091.6945 1108.9419 1170.1390 1178.7025 1189.2700 1225.9056 1238.1117 1264.0746 1290.8590 1374.1877 1376.6603 1391.2956 1397.1856 1403.4104 1434.8781 1463.5278 1465.5278 1471.4213 1473.6226 1480.4433 1482.5920 1577.7242 1586.9053 1598.0906 1616.1098 1637.2516 2970.7659 2976.5662 3042.5502 3047.1330 3086.5844 3114.9500 3128.3279 3153.5271 3156.8228 3165.4154 3176.9879 3184.7110 3186.6500
redmass: 4.6880 5.0106 5.0060 6.5404 1.0474 8.6994 4.2628 1.1632 3.6011 6.9004 3.1650 6.2072 4.6124 2.7096 8.5050 4.7144 6.8800 2.9150 3.5780 3.6489 4.7181 3.0605 6.5339 4.7434 5.9239 7.1445 5.8781 5.0623 3.7262 3.3134 3.8861 2.3292 2.9491 4.3301 1.2552 1.5880 2.8302 1.3818 1.3363 1.3506 1.4801 1.3721 4.6418 2.5339 1.5467 1.6294 2.6508 2.8575 1.8700 1.3510 1.5093 1.1423 2.5491 2.5520 3.2705 2.0044 1.2493 6.2269 5.4610 1.2494 4.1282 1.2492 1.6738 1.7873 1.2144 2.3136 1.4089 1.2550 1.0673 8.2429 6.3123 6.2852 7.1063 11.7227 1.0379 1.0400 1.0969 1.0968 1.0982 1.0958 1.0878 1.0938 1.0891 1.0895 1.0970 1.0967 1.0970
irintensity: 0.1266 0.1067 0.1517 0.1848 0.1678 1.8096 0.3522 1.1565 3.0517 1.1899 5.2173 2.2082 3.1288 0.0607 2.3931 1.7133 17.3685 0.0247 2.6225 13.4543 1.1990 0.0113 20.7780 2.5174 1.2981 1.8295 9.5184 16.3714 3.8528 10.6700 20.7436 22.3842 25.6714 11.2712 2.2898 50.1822 0.2326 1.2783 0.9455 0.8921 34.1879 3.1683 189.5312 66.9854 13.0959 5.0833 377.4114 44.6622 69.9597 8.4292 162.4356 13.1612 35.4323 163.0794 211.4619 0.1421 1.8197 2.8097 2.6460 4.6532 15.0550 23.7576 9.4512 11.6370 12.4097 24.8809 33.2593 36.2597 27.7323 4.2914 34.6024 89.2296 16.8348 180.2830 41.1258 21.3688 37.6066 1.9275 24.0055 11.4836 10.1521 27.6561 0.0032 0.9910 3.3225 3.7377 1.3845
temp: 298.150 k
press: 1.00000 atm
elementType: 17 8 8 6 6 6 6 6 6 6 6 6 6 6 6 6 6 6 1 1 1 1 1 1 1 1 1 1 1 1 1
symmnumber: 1
zpe: 619300.2 jmol-1
zpe.correction: 0.235879 hartree
zpe.thermalcorrener: 0.252763 hartree
zpe.thermalcorrenthalpy: 0.253708 hartree
zpe.thermalcorrgfe: 0.188779 hartree
zpe.sumelectzpe: -1188.645583 hartree
zpe.sumelectthermal: -1188.628698 hartree
zpe.sumelectthermalent: -1188.627754 hartree
zpe.sumelectthermalfe: -1188.692683 hartree
dipole: -1.3998 1.8168 -0.5448
dipole: 2.3573
quadrupole: -104.7562 -106.9901 -113.9580
quadrupole: -6.4977 1.9678 1.9864
quadrupole: 3.8119 1.5780 -5.3899 -6.4977 1.9678 1.9864
hfenergy: -1188.8814618 hartree
pointgroup: C01 [X(C15H13Cl1O2)]
dipole: -0.5643549 -0.6871871 0.2634908 debye
polarizability: 293.9740887|-9.1827822|166.1668708|3.0425796|-11.6601003|99.0665647 unknown
InChI: InChI=1S/C15H13ClO2/c1-10-4-3-5-14(11(10)2)18-15(17)12-6-8-13(16)9-7-12/h3-9H,1-2H3
charge 0 multiplicity 1
31 atoms
Cl 6.351158 -0.843303 0.483612
O  -0.369299 0.01003 0.208083
O  0.22882 1.895631 -1.067475
C  -2.609665 -0.847838 -0.138969
C  -4.024678 -0.655216 -0.090256
C  -1.783368 0.261863 0.165468
C  -4.546915 0.615985 0.250943
C  -2.294926 1.530687 0.508302
C  -2.018564 -2.19699 -0.500458
C  -4.963248 -1.806052 -0.4053
C  -3.692693 1.701779 0.54649
C  1.952961 0.427586 -0.163787
C  0.554505 0.885236 -0.406666
C  3.004896 1.164024 -0.76892
C  2.25636 -0.700225 0.6428
C  4.347285 0.782612 -0.577368
C  3.596283 -1.090659 0.84369
C  4.620611 -0.342225 0.22835
H  -5.633626 0.754975 0.284192
H  -1.618259 2.359837 0.726613
H  -0.920502 -2.153147 -0.550967
H  -2.297811 -2.96747 0.244028
H  -2.396518 -2.547867 -1.479295
H  -4.793275 -2.66888 0.266911
H  -6.017023 -1.497813 -0.300255
H  -4.821368 -2.176826 -1.438862
H  -4.112771 2.678871 0.807011
H  2.753304 2.032226 -1.386382
H  1.443188 -1.260318 1.111114
H  5.163105 1.343895 -1.041041
H  3.841234 -1.956705 1.464796
