program: Gaussian 09
title: 000260766
version: EM64L-G09RevD.01
frameworkgroup: C1[X(C13H9ClO2)]
method: RPBEPBE
basis: SDD
operation: Freq
keyword: #p
keyword: freq=noraman
keyword: PBEPBE/SDD
title: #p freq=noraman PBEPBE/SDD
converged: YES YES NO NO
title: Mulliken charges:
elementType: Cl O O C C C C C C C C C C C C C H H H H H H H H H
charge: -0.039893 -0.316201 -0.237492 0.228922 0.398098 -0.320530 -0.315252 0.158483 -0.207966 -0.196565 -0.320253 -0.404140 -0.097575 -0.210076 -0.194985 -0.245860 0.275795 0.271990 0.262508 0.260286 0.304783 0.251382 0.230833 0.231898 0.231809
chargesum: 0.00000
title: Mulliken charges with hydrogens summed into heavy atoms:
elementType: Cl O O C C C C C C C C C C C C C
charge: -0.039893 -0.316201 -0.237492 0.228922 0.398098 -0.044735 -0.043261 0.158483 0.054542 0.063721 -0.015469 -0.152758 -0.097575 0.020757 0.036913 -0.014051
polarizability: 2.82578256e+02 1.06891258e+00 1.54145110e+02 8.84319425e-02 3.09326952e-01 5.75881837e+01
1716.lowfreq: -2.9906 0.0011 0.0015 0.0017 9.2228 11.4925 25.3409 34.9394 69.8531
frequency: 25.1055 34.8324 69.8529 74.6852 94.8759 190.0737 219.0706 231.2787 283.2726 304.9318 327.6503 395.1873 409.6261 410.3240 472.0106 503.7712 513.0891 572.6372 608.7288 623.2602 661.8900 693.1691 705.5921 738.0468 762.0897 765.8245 819.2964 838.7570 843.9676 851.6998 924.7484 977.2877 978.7929 985.6956 988.4992 996.9051 997.3075 1019.7863 1042.3821 1071.5127 1081.7195 1109.9174 1152.4273 1170.8032 1178.7023 1193.4540 1238.3746 1291.6655 1311.6649 1376.9139 1383.6002 1398.5386 1442.7940 1469.1039 1472.6892 1576.5949 1589.3488 1598.0059 1607.8100 1624.5323 3133.8611 3144.7830 3158.1695 3160.6780 3166.5908 3173.3207 3177.9125 3188.7409 3212.6423
redmass: 4.3670 5.4204 7.2777 7.8351 8.6860 7.1997 9.3052 5.7747 6.8584 5.8803 8.3841 7.7933 2.9427 2.9107 3.4333 3.1240 8.1367 7.9941 6.4907 7.1552 4.8917 2.2785 7.7839 3.8061 8.1555 1.5366 7.3901 1.2578 1.2513 1.5778 1.3985 1.3595 1.3564 6.2925 1.3625 1.3036 5.2017 2.6047 3.2903 2.7520 1.5146 1.3420 2.4103 1.0670 1.1231 1.4271 4.2855 1.2501 1.3295 5.4919 9.2587 4.1746 2.2803 2.2078 2.4411 8.3295 6.3725 6.2886 6.4690 11.2927 1.0854 1.0903 1.0890 1.0949 1.0896 1.1000 1.0970 1.0967 1.0946
irintensity: 0.2487 0.0622 0.0638 0.5154 2.1244 3.5858 2.0553 0.0376 0.9700 0.2129 2.4668 17.2551 0.1100 0.0002 8.0177 16.5623 24.5811 0.7423 2.6996 1.4947 17.6664 32.6942 6.4446 24.5245 7.0558 89.2963 3.0822 2.8245 0.4521 52.3560 12.0353 0.4131 0.6743 33.3948 0.3510 1.9848 137.6516 2.5549 219.7292 76.6639 13.4434 9.4209 293.9232 9.1438 58.1196 104.6955 391.7792 2.4834 4.6647 5.3940 10.2690 15.1457 11.5815 64.8545 82.9734 7.2711 33.7541 93.0740 4.3856 183.9765 0.2899 15.0102 0.0010 28.7809 0.8764 13.1876 3.1043 1.7811 5.3155
temp: 298.150 k
press: 1.00000 atm
elementType: 17 8 8 6 6 6 6 6 6 6 6 6 6 6 6 6 1 1 1 1 1 1 1 1 1
symmnumber: 1
zpe: 477387.0 jmol-1
zpe.correction: 0.181827 hartree
zpe.thermalcorrener: 0.195173 hartree
zpe.thermalcorrenthalpy: 0.196117 hartree
zpe.thermalcorrgfe: 0.139464 hartree
zpe.sumelectzpe: -1110.188597 hartree
zpe.sumelectthermal: -1110.175252 hartree
zpe.sumelectthermalent: -1110.174307 hartree
zpe.sumelectthermalfe: -1110.230960 hartree
dipole: 1.2044 -1.4658 0.0232
dipole: 1.8973
quadrupole: -91.3595 -91.5070 -104.1875
quadrupole: -5.3447 0.1179 0.1795
quadrupole: 4.3251 4.1777 -8.5028 -5.3447 0.1179 0.1795
hfenergy: -1110.3704243 hartree
pointgroup: C01 [X(C13H9Cl1O2)]
dipole: -0.4991055 -0.2549637 0.4930058 debye
dipolederiv: -0.9704086 0.0717264 -0.1936695 0.0920319 -0.078673 0.0425239 -0.2341151 0.0414288 -0.1587157 -2.3003806 -0.2086371 0.3165771 -0.4513275 -0.2658771 0.1670386 0.8367458 0.1822512 -0.5087347 -0.8383076 0.0815736 -0.1954989 -0.0695153 -0.4302858 0.2386439 0.1225088 0.2500498 -0.8211568 -0.7623835 0.0515321 -0.1444908 0.0575062 -0.0481439 0.0381093 -0.1570875 0.0380638 -0.1175583 1.5339658 0.1038748 -0.1347365 0.0492062 0.1063507 -0.0110986 -0.0196705 -0.0076719 0.1202339 0.246974 -0.0579005 0.1378238 0.0883214 -0.0717972 -0.0495999 -0.1687996 -0.0565419 0.0131592 0.1622132 0.0183548 -0.0266005 -0.1058303 -0.0715014 -0.0603965 0.2339799 -0.0544184 0.0270602 2.5967303 0.018075 0.0851231 0.4291345 0.4633603 -0.4114016 -0.7910436 -0.4397592 1.1172158 -0.3721177 0.0970328 -0.2174159 0.1392894 -0.1114863 0.0111474 -0.305558 0.0088475 -0.1423206 -0.5617481 -0.0141786 0.0085104 -0.0393085 -0.0842155 -0.0569683 0.0617317 -0.0558123 0.0105676 -0.3306688 0.0042769 -0.0196896 0.0245234 -0.1383138 -0.0223718 -0.0683663 -0.0223577 -0.1036524 -0.2700531 -0.0323299 0.0649148 -0.051297 -0.1540113 -0.0545676 0.1085917 -0.0531885 -0.052985 1.3816435 -0.104666 0.2862729 -0.1315005 0.0088148 -0.1336645 0.3406432 -0.1321528 0.2421935 0.0249462 -0.0223702 0.0608152 -0.0465765 -0.104477 -0.1020381 0.1169545 -0.0993444 0.0780712 0.0396576 0.0229529 -0.0371388 0.0455497 -0.0995495 -0.1029084 -0.0894765 -0.1046347 0.0765217 0.0190643 0.003609 0.0056655 0.0111585 -0.1593812 -0.021413 -0.0112614 -0.0222506 -0.1219548 0.1296904 0.022609 -0.0484566 0.0066034 0.1302653 0.0568031 -0.0152182 0.0576065 0.0350039 0.0728387 -0.0325875 0.0654367 -0.0385836 0.1317709 0.0433946 0.0783662 0.043868 0.0650577 0.0006379 -0.0318276 0.0593253 -0.0291203 0.143213 0.0484813 0.0539778 0.0484164 0.0673151 0.0696168 0.0145878 -0.0351757 0.0184799 0.1309128 0.0738088 -0.0433194 0.0736031 0.0084784 0.1888809 -0.021386 0.0465871 -0.0176117 0.1622405 0.0491912 0.0409453 0.0476648 0.0811247 0.0573965 0.0356318 -0.0864324 0.0371095 0.1461041 0.0620386 -0.0882339 0.0617066 0.0308285 -0.0005882 0.0283359 -0.073575 0.0404068 0.122652 0.0773796 -0.1002981 0.0763782 -0.0189008 0.0211204 -0.0364454 0.0709127 -0.046022 0.1171519 0.0892119 0.0914539 0.0896683 -0.0324615 -0.1387202 -0.0118441 0.0049156 -0.0126274 0.1548766 0.0286561 0.0065494 0.0285793 0.1056092 unknown
polarizability: 282.0963861|1.8124658|74.9179558|8.439503|-37.0098753|137.2972076 unknown
InChI: InChI=1S/C13H9ClO2/c14-11-8-6-10(7-9-11)13(15)16-12-4-2-1-3-5-12/h1-9H
charge 0 multiplicity 1
25 atoms
Cl 5.93424 -0.281633 0.884705
O  -0.807641 -0.107114 0.196731
O  -0.254559 0.892116 -1.865743
C  1.496822 0.198121 -0.324987
C  -2.233269 -0.098513 0.088267
C  2.526718 0.635934 -1.198937
C  1.835737 -0.387627 0.922769
C  0.086722 0.379083 -0.774404
C  3.880634 0.493241 -0.83789
C  3.187334 -0.535287 1.295617
C  -2.974117 0.379766 -1.018624
C  -2.874511 -0.635514 1.227949
C  4.188906 -0.091966 0.407696
C  -4.385717 0.307532 -0.958201
C  -4.282289 -0.697633 1.266526
C  -5.045047 -0.225628 0.171636
H  2.248819 1.085348 -2.157516
H  1.041002 -0.724164 1.592718
H  4.678764 0.82748 -1.506336
H  3.458582 -0.984979 2.254724
H  -2.467157 0.792299 -1.890783
H  -2.263739 -0.994676 2.061745
H  -4.96912 0.675161 -1.809489
H  -4.780898 -1.113511 2.148546
H  -6.138714 -0.273334 0.200583
