program: Gaussian 09
title: 000260730
version: EM64L-G09RevD.01
frameworkgroup: C1[X(C11H23ClO2)]
method: RPBEPBE
basis: SDD
operation: Freq
keyword: #p
keyword: freq=noraman
keyword: PBEPBE/SDD
title: #p freq=noraman PBEPBE/SDD
converged: YES YES NO NO
title: Mulliken charges:
elementType: Cl O O C C C C C C C C C C C H H H H H H H H H H H H H H H H H H H H H H H
charge: -0.092248 -0.292900 -0.433398 -0.376750 -0.377507 -0.371068 -0.399214 -0.352943 -0.251709 -0.356198 -0.235894 -0.695941 -0.095824 -0.594585 0.194473 0.193872 0.191771 0.189741 0.190097 0.189101 0.210940 0.209149 0.188234 0.188665 0.186994 0.190452 0.194757 0.195161 0.190637 0.219194 0.209859 0.215554 0.209977 0.246469 0.285137 0.296211 0.339733
chargesum: 0.00000
title: Mulliken charges with hydrogens summed into heavy atoms:
elementType: Cl O O C C C C C C C C C C C
charge: -0.092248 -0.292900 -0.093665 0.011595 0.004005 0.008130 0.020875 0.023956 0.125736 0.033720 0.173938 -0.060551 0.150645 -0.013237
polarizability: 1.73553839e+02 -1.19661933e+00 1.19596047e+02 -4.25933924e+00 -3.61886167e+00 1.18836663e+02
1716.lowfreq: -12.4084 -3.5658 -0.0016 -0.0012 -0.0010 3.4808 12.8587 28.7899 37.5206
frequency: 9.7120 27.2876 37.4714 41.4960 69.6135 73.6190 90.8927 109.8224 112.8907 143.3273 150.2632 160.9458 165.8129 186.1606 205.7018 237.6672 257.4794 330.0609 344.5058 407.6302 417.2858 439.7057 482.3307 505.9910 529.1308 665.8836 721.0838 729.1971 754.2720 798.6295 832.0915 863.4342 886.3275 889.7209 924.5117 938.8700 987.7740 992.1910 1009.4932 1018.6897 1044.8924 1048.9035 1055.7352 1078.2794 1079.6337 1084.0482 1102.6533 1126.3585 1149.1609 1171.2951 1187.8696 1202.9870 1218.9019 1222.8345 1225.8211 1259.0767 1262.1151 1274.8666 1281.8425 1282.9655 1292.8529 1295.7261 1301.5741 1317.8099 1336.5626 1350.6959 1355.2682 1358.0132 1368.8660 1391.1560 1402.2606 1422.3907 1461.1279 1461.8769 1466.6522 1468.5675 1472.6088 1478.0147 1478.6108 1483.5251 1488.1336 1492.1695 2914.7928 2940.2714 2950.7592 2952.6791 2955.0590 2962.3990 2963.6931 2968.5273 2972.1779 2985.4209 2988.8969 2993.0228 3001.4687 3004.7256 3022.4524 3034.9997 3038.0561 3056.4805 3068.8806 3070.9621 3074.6035 3166.9585 3504.0061
redmass: 3.9219 2.9096 4.5464 2.7987 1.7747 3.4926 3.8126 3.7584 1.7836 2.5671 1.9775 3.3572 3.3601 4.9896 4.2825 1.1068 3.2128 3.6982 3.1399 1.9002 1.4227 3.3329 3.2691 3.6874 3.9899 3.7651 1.0620 1.0822 1.1126 1.1601 2.8221 1.2003 1.9912 1.8748 6.0612 1.1885 1.9903 4.2841 1.1152 4.1619 2.8886 1.7186 4.8002 2.4856 2.3537 2.4174 1.6522 2.7687 1.3461 1.2775 1.6528 1.4890 1.2957 1.3944 1.3315 1.2560 1.3007 1.0850 1.0873 1.2447 1.1248 1.0986 1.3138 1.2875 1.3902 1.4031 1.6253 1.6007 1.2875 1.2179 1.4717 1.1191 1.0713 1.0747 1.0696 1.0825 1.0803 1.0775 1.0436 1.0827 1.0860 1.0888 1.0548 1.0569 1.0589 1.0587 1.0591 1.0591 1.1059 1.0587 1.0364 1.0968 1.0590 1.0991 1.1025 1.1022 1.1044 1.0856 1.1048 1.1046 1.1007 1.0993 1.0569 1.1122 1.0653
irintensity: 0.0112 0.1871 0.0666 0.2959 1.6286 0.2875 0.6209 1.9313 2.4730 2.2115 0.8431 4.5350 3.8668 1.0518 6.1499 0.0204 3.7102 1.7236 1.8991 21.9513 123.1278 10.2848 4.4910 10.9816 21.9050 15.3798 14.1287 0.1792 4.1570 0.2206 19.1324 1.2091 5.7586 0.8333 15.6459 0.6129 52.0174 4.9576 1.1726 23.5516 23.1869 7.9885 91.7018 5.6815 25.2660 70.4180 28.4431 11.7846 1.2001 6.2310 0.3218 32.4126 5.2478 0.7385 5.5153 0.0436 0.4670 0.2043 1.8112 16.7170 0.0609 0.0750 1.3123 16.3593 0.1690 4.1720 1.1484 1.3263 37.5414 11.3686 9.5407 20.5181 0.0969 0.0166 0.7392 4.8942 7.2938 0.9234 11.9051 1.3799 14.8772 17.5872 44.7057 55.0606 0.1399 4.7244 0.5143 26.7288 44.1897 149.2819 37.0643 0.3772 47.9256 0.5775 34.6521 1.0866 0.0234 14.9991 79.7218 112.6255 99.8036 54.9243 15.8205 4.0532 12.5046
temp: 298.150 k
press: 1.00000 atm
elementType: 17 8 8 6 6 6 6 6 6 6 6 6 6 6 1 1 1 1 1 1 1 1 1 1 1 1 1 1 1 1 1 1 1 1 1 1 1
symmnumber: 1
zpe: 852010.1 jmol-1
zpe.correction: 0.324514 hartree
zpe.thermalcorrener: 0.343116 hartree
zpe.thermalcorrenthalpy: 0.344061 hartree
zpe.thermalcorrgfe: 0.273490 hartree
zpe.sumelectzpe: -1042.276089 hartree
zpe.sumelectthermal: -1042.257486 hartree
zpe.sumelectthermalent: -1042.256542 hartree
zpe.sumelectthermalfe: -1042.327113 hartree
dipole: -2.2323 -0.1698 -0.2570
dipole: 2.2534
quadrupole: -109.1654 -99.8794 -92.5668
quadrupole: 2.7625 1.2791 2.1183
quadrupole: -8.6282 0.6578 7.9704 2.7625 1.2791 2.1183
hfenergy: -1042.6006025 hartree
pointgroup: C01 [X(C11H23Cl1O2)]
dipole: 0.873799 0.0747413 0.1299314 debye
polarizability: 173.4915572|-4.5258932|120.2951213|0.8670075|-3.7232501|118.1998705 unknown
InChI: InChI=1S/C11H23ClO2/c1-2-3-4-5-6-7-8-14-10-11(13)9-12/h11,13H,2-10H2,1H3
charge 0 multiplicity 1
37 atoms
Cl -5.221505 0.925747 -2.202595
O  -2.343508 -0.298834 0.174907
O  -6.020534 -0.102408 0.679483
C  2.65104 -0.285276 -0.14329
C  1.396848 0.480157 0.335551
C  3.97066 0.461407 0.155021
C  0.080594 -0.269459 0.025944
C  5.227841 -0.309055 -0.307812
C  -1.151881 0.487446 0.52763
C  6.547662 0.438624 -0.009581
C  -3.589035 0.326506 0.627165
C  7.799156 -0.340036 -0.469679
C  -4.740843 -0.570565 0.140364
C  -4.774816 -0.737874 -1.379486
H  2.573013 -0.470828 -1.234829
H  2.676971 -1.283776 0.340695
H  1.375878 1.481524 -0.143091
H  1.475455 0.65807 1.428678
H  3.948711 1.456119 -0.33761
H  4.042667 0.656678 1.245706
H  0.096749 -1.272783 0.493947
H  -0.017362 -0.426013 -1.065937
H  5.252111 -1.303125 0.185978
H  5.158291 -0.506072 -1.398253
H  -1.106649 0.625044 1.631656
H  -1.216728 1.494808 0.057686
H  6.614339 0.638158 1.079609
H  6.524311 1.430432 -0.505788
H  -3.689699 1.351327 0.205787
H  -3.62571 0.388987 1.734726
H  7.861225 -1.323219 0.034059
H  8.728577 0.214544 -0.243775
H  7.772263 -0.524382 -1.56038
H  -4.601702 -1.580053 0.570918
H  -5.568922 -1.425136 -1.703198
H  -3.788236 -1.011101 -1.778258
H  -6.304833 0.68422 0.141147
