program: Gaussian 09
title: 000260722
version: EM64L-G09RevD.01
frameworkgroup: C1[X(C9H13NO2)]
method: RPBEPBE
basis: SDD
operation: Freq
keyword: #p
keyword: freq=noraman
keyword: PBEPBE/SDD
title: #p freq=noraman PBEPBE/SDD
converged: YES YES NO NO
title: Mulliken charges:
elementType: O O N C C C C C C C C C H H H H H H H H H H H H H
charge: -0.207067 -0.199975 0.050617 0.390210 -0.327556 -0.203261 -0.547279 -0.538384 -0.233500 -0.451884 -0.218273 -0.706534 0.304855 0.244759 0.233240 0.262594 0.238218 0.257253 0.249187 0.242681 0.229422 0.245691 0.236876 0.226262 0.221850
chargesum: 0.00000
title: Mulliken charges with hydrogens summed into heavy atoms:
elementType: O O N C C C C C C C C C
charge: -0.207067 -0.199975 0.050617 0.390210 -0.022701 0.041498 -0.051445 -0.042914 0.015687 0.020218 0.027418 -0.021547
polarizability: 1.08109404e+02 1.21156550e+00 9.76446411e+01 -3.28618142e+00 4.64278695e+00 9.76697272e+01
1716.lowfreq: -26.3735 -17.9603 -0.0007 -0.0005 -0.0003 6.7820 42.4381 86.6493 131.1628
frequency: 42.1247 86.5638 131.1316 157.7761 202.8065 217.9251 287.4089 328.4556 354.7310 377.7318 425.7263 485.5793 495.1530 528.9094 659.9489 681.4989 714.9965 728.9483 766.5864 775.7625 811.7296 825.0953 857.5444 904.6464 923.5316 932.5262 944.0230 953.2067 960.2017 997.8000 1008.9123 1041.4935 1069.1843 1088.4650 1099.7209 1121.3944 1133.0002 1170.7309 1180.7615 1211.2725 1224.4035 1236.4383 1261.6952 1268.8951 1277.3161 1292.1777 1320.4695 1329.4358 1389.1647 1404.2936 1460.6943 1472.4302 1480.3218 1482.2696 1482.8838 1582.3111 2988.6987 2996.4105 3021.3527 3029.1802 3049.6315 3082.7288 3088.1759 3089.3786 3093.6315 3100.6838 3125.1580 3157.6139 3190.3016
redmass: 10.9509 2.5374 3.3469 3.7882 1.4359 2.9450 2.5634 3.6803 3.2610 2.2797 3.5105 2.1740 3.2966 3.3284 4.0999 4.1286 2.8009 1.6769 4.1042 3.2517 2.4935 2.1956 2.1369 2.3571 1.6436 1.8382 2.2731 1.7801 2.2846 1.6772 1.7351 1.9736 1.4443 1.2270 1.7898 1.3470 1.9139 1.5881 2.5412 3.2642 1.7278 1.7661 1.3648 1.5978 1.2992 1.4973 1.6725 1.4852 8.2898 1.2419 1.0910 1.0867 1.0501 1.0927 1.0530 5.7414 1.0360 1.0607 1.0610 1.0606 1.1010 1.0994 1.0946 1.1006 1.1003 1.1051 1.0905 1.0874 1.1098
irintensity: 0.0549 0.0672 2.2005 1.8077 1.2638 0.6544 1.7425 4.3434 0.9678 1.5903 0.5721 3.1900 1.8902 1.1345 2.0202 0.3658 8.5893 56.8059 27.0486 14.5295 1.8312 6.4768 10.4161 2.4900 2.5651 0.5270 0.9478 7.0095 1.0607 4.4198 11.0364 1.2113 0.2624 3.9481 0.9808 2.9602 3.9203 2.7071 7.1070 43.3690 5.2237 29.7446 1.5720 4.7987 0.1653 4.4110 10.7455 8.4206 152.0347 11.3159 3.2259 9.3299 8.3608 11.2505 13.0026 1.6472 22.0647 11.3181 34.0375 14.5121 2.2290 33.7782 25.7046 29.1670 26.8793 28.0817 4.2478 5.8620 16.7278
temp: 298.150 k
press: 1.00000 atm
elementType: 8 8 7 6 6 6 6 6 6 6 6 6 1 1 1 1 1 1 1 1 1 1 1 1 1
symmnumber: 1
zpe: 542286.1 jmol-1
zpe.correction: 0.206546 hartree
zpe.thermalcorrener: 0.217400 hartree
zpe.thermalcorrenthalpy: 0.218344 hartree
zpe.thermalcorrgfe: 0.169993 hartree
zpe.sumelectzpe: -554.921184 hartree
zpe.sumelectthermal: -554.910330 hartree
zpe.sumelectthermalent: -554.909386 hartree
zpe.sumelectthermalfe: -554.957738 hartree
dipole: 3.1364 2.2837 -1.0980
dipole: 4.0321
quadrupole: -76.8122 -70.3632 -73.2748
quadrupole: -6.6531 -0.6099 0.0560
quadrupole: -3.3288 3.1202 0.2086 -6.6531 -0.6099 0.0560
hfenergy: -555.12773 hartree
pointgroup: C01 [X(C9H13N1O2)]
dipole: -1.2548783 -0.8677037 -0.4346444 debye
dipolederiv: -0.5486603 -0.2253761 0.1889278 -0.2489351 -0.3467662 0.1525699 0.0368287 0.0549525 -0.6058855 -0.4478154 -0.1403237 -0.1808374 -0.1542444 -0.2685638 -0.0848311 0.0196643 0.0444396 -0.7311454 0.6299686 0.4921074 0.0023608 0.5067741 0.3141827 -0.0661272 0.0409196 -0.0607847 1.068432 0.1904691 -0.0419761 -0.0531148 -0.0672812 0.087132 -0.0188607 -0.1991263 -0.0144303 0.0142437 0.0312336 -0.0618683 -0.0096262 -0.025129 -0.0831931 -0.0052035 0.0081026 -0.0411113 0.0614329 0.0880105 -0.1415311 0.043593 -0.0898325 0.093003 -0.0914206 -0.0202237 -0.0334788 0.0365721 0.0208239 0.0335772 -0.0107395 0.0044374 -0.0711675 0.112441 0.0634631 0.0694668 0.055697 0.0636117 0.096625 -0.0801763 0.0764841 0.0566196 0.0493334 -0.0534709 0.0327431 0.0042388 -0.0297324 0.1027395 0.0856152 0.0854784 0.0153683 -0.0681989 0.1611437 0.0108622 -0.2008196 -0.0355186 -0.0837828 -0.0131629 -0.033132 0.1602874 -0.0017488 0.0119796 -0.0371812 0.0623155 -0.1393613 0.1081543 0.1085476 0.1622024 0.0343093 -0.0450272 0.1158841 -0.1055004 -0.0614171 0.023205 0.0621964 -0.054111 0.0761758 -0.0121748 0.0428221 -0.0468929 0.0311518 0.0112868 0.0422769 0.0307874 -0.0744948 0.0235193 0.0656433 0.0315265 -0.0620693 0.0488366 -0.0188301 -0.0404211 0.0927211 -0.0625474 0.0965564 -0.0399393 0.0830065 -0.0555953 0.0734234 0.0243994 0.0359562 0.0062101 -0.0048405 -0.001216 0.0170487 -0.1306601 0.0031374 -0.0848967 -0.068469 0.0449981 -0.0852803 0.0699251 -0.033077 -0.0376801 0.0519237 0.0123275 0.0258473 0.0684852 0.0058078 -0.1474722 -0.0242301 -0.1089995 -0.0750163 -0.0207114 0.0031738 0.0020031 0.0744587 -0.0601043 0.0546589 0.1228223 0.016858 0.0668006 -0.0084629 0.0993124 -0.0403826 -0.0330685 0.1125832 -0.03061 -0.0423966 -0.0646659 -0.0776401 0.0688843 -0.0496733 0.0572021 0.1267408 0.0042774 0.0363049 0.0776856 0.0077039 0.0330613 0.0674391 0.0782318 0.0245975 -0.0652806 -0.0284081 -0.04786 -0.0769355 -0.0821999 -0.0027555 -0.0300319 -0.0971914 -0.0045661 0.0466546 0.021615 -0.0876101 -0.0928655 -0.1028525 0.0565407 -0.0135593 -0.1334093 -0.0204332 0.0869921 -0.0423114 -0.0683889 -0.0488388 -0.1288358 0.0371813 -0.0378664 -0.0565837 0.0007175 0.0532067 0.0059574 -0.0451611 0.1138488 -0.0259418 0.0970939 0.0193387 0.0857777 0.0550929 -0.0702198 0.0515383 0.0911585 0.0155915 0.1101529 -0.1193755 -0.0565752 0.0342898 -0.0885714 0.0599793 unknown
polarizability: 107.9423105|1.114696|97.0461957|3.4199187|-4.7039654|98.4352657 unknown
InChI: InChI=1S/C9H13NO2/c1-2-9(10(11)12)6-7-3-4-8(9)5-7/h3-4,7-8H,2,5-6H2,1H3
charge 0 multiplicity 1
25 atoms
O  2.236765 1.310066 -0.833641
O  1.876091 0.927228 1.376333
N  1.562264 0.79703 0.135537
C  0.338529 -0.102617 -0.245096
C  -0.644511 -0.187892 0.990531
C  -1.894264 0.878744 -0.591759
C  -0.524898 0.632536 -1.333439
C  -1.381887 1.18348 0.85162
C  -1.769714 -1.145561 0.569425
C  0.952318 -1.442419 -0.731484
C  -2.525622 -0.504216 -0.368307
C  1.786015 -2.205818 0.317765
H  -0.141889 -0.399307 1.941862
H  -2.531305 1.636326 -1.071416
H  -0.63972 0.009867 -2.236209
H  -0.048904 1.58053 -1.635085
H  -0.710167 2.058565 0.911702
H  -2.199576 1.292347 1.5821
H  -1.876252 -2.173515 0.925126
H  1.565525 -1.233286 -1.62888
H  0.099662 -2.064327 -1.062312
H  -3.372043 -0.906975 -0.931025
H  2.667983 -1.627646 0.645864
H  1.188025 -2.445646 1.215217
H  2.149575 -3.157591 -0.109127
