program: Gaussian 09
title: 000260715
version: EM64L-G09RevD.01
frameworkgroup: C1[X(C10H12N2)]
method: RPBEPBE
basis: SDD
operation: Freq
keyword: #pfreq=noraman
keyword: PBEPBE/SDD
title: #p freq=noraman PBEPBE/SDD
converged: YES YES NO NO
title: Mulliken charges:
elementType: N N C C C C C C C C C C H H H H H H H H H H H H
charge: -0.447761 -0.075905 0.092397 -0.179882 0.351311 0.353129 0.180309 -0.356766 -0.379252 -0.802578 -0.824181 -0.783598 0.300286 0.221355 0.225350 0.198515 0.238990 0.238840 0.268280 0.222793 0.222738 0.271439 0.232173 0.232015
chargesum: 0.00000
title: Mulliken charges with hydrogens summed into heavy atoms:
elementType: N N C C C C C C C C C C
charge: -0.147475 -0.075905 0.092397 -0.179882 0.351311 0.353129 0.180309 -0.135411 -0.153902 -0.126233 -0.110369 -0.047971
polarizability: 1.61051118e+02 -3.39259390e+00 1.40545477e+02 1.15298449e-02 -1.68876583e-02 6.35085297e+01
1716.lowfreq: -131.7925 -44.1604 -11.5202 -9.7914 -0.0006 -0.0004 0.0007 1.7217 86.8787
frequency: -131.7918 -43.9836 86.8758 126.8951 135.0305 191.2585 199.8199 253.9144 313.9308 333.9323 340.2000 438.2320 538.8528 545.2921 546.6148 571.4639 579.3844 589.9642 658.5273 733.0754 752.2397 783.8978 811.8411 932.6525 940.8650 956.9153 965.4993 998.1366 1032.8279 1043.0494 1045.9654 1046.0846 1090.8957 1168.9117 1212.5057 1259.6461 1263.4213 1294.2037 1339.9572 1369.9387 1392.2711 1394.8838 1399.7185 1419.9870 1465.2997 1466.5545 1467.2243 1469.0074 1479.4182 1481.4243 1518.0059 1535.8790 1617.3207 1632.9672 2974.7560 2977.7228 2980.4015 3052.2823 3054.3860 3056.0995 3068.4235 3102.2568 3110.6013 3122.0765 3135.8559 3596.0000
redmass: 1.0203 1.0356 1.0580 2.7645 3.2128 2.8591 4.5479 2.6483 3.9585 3.5864 2.8058 5.1101 3.6861 2.9846 3.9015 5.8155 3.0811 1.3960 4.4435 4.9275 5.2552 7.5102 1.2505 1.3157 1.7814 3.4042 2.0022 1.8542 1.4908 1.5148 1.4926 2.7534 1.8443 1.9338 2.3834 2.3777 2.0584 4.2457 3.8063 2.8360 1.2386 1.3228 1.2819 3.9142 1.1210 1.0485 1.1417 1.0444 1.0976 1.0477 3.9401 4.9792 7.4338 7.0598 1.0366 1.0379 1.0392 1.0975 1.0980 1.0984 1.0983 1.0980 1.0870 1.0963 1.0957 1.0808
irintensity: 0.3114 0.4898 0.3302 0.3895 5.9666 1.8229 9.3357 1.4149 0.7575 0.1290 4.0284 0.4263 4.0018 1.2271 2.9139 0.4790 4.8966 103.8271 0.1419 2.4780 0.9025 0.0027 37.8483 0.0947 0.4896 0.3825 0.6729 2.0517 6.3694 5.2583 6.0287 3.9052 24.0674 3.6719 20.1730 0.9804 4.1785 26.0542 65.7947 48.1678 18.3549 13.5051 0.2899 1.7749 5.4460 13.4806 3.5841 13.6029 22.1068 14.7607 12.6685 69.1053 9.9320 8.7602 43.9347 40.7510 36.5383 22.3055 19.8289 21.0478 27.7121 6.3342 13.6069 5.6488 30.9680 29.5140
temp: 298.150 k
press: 1.00000 atm
elementType: 7 7 6 6 6 6 6 6 6 6 6 6 1 1 1 1 1 1 1 1 1 1 1 1
symmnumber: 1
zpe: 517166.8 jmol-1
zpe.correction: 0.196978 hartree
zpe.thermalcorrener: 0.207083 hartree
zpe.thermalcorrenthalpy: 0.208027 hartree
zpe.thermalcorrgfe: 0.161537 hartree
zpe.sumelectzpe: -496.925132 hartree
zpe.sumelectthermal: -496.915027 hartree
zpe.sumelectthermalent: -496.914083 hartree
zpe.sumelectthermalfe: -496.960573 hartree
dipole: 0.9374 -3.5167 0.0019
dipole: 3.6395
quadrupole: -61.0743 -64.8532 -74.7463
quadrupole: -6.2715 0.0020 -0.0034
quadrupole: 5.8169 2.0381 -7.8550 -6.2715 0.0020 -0.0034
hfenergy: -497.1221101 hartree
pointgroup: C01 [X(C10H12N2)]
dipole: 0.3698722 1.3832843 -0.0007338 debye
dipolederiv: -0.6706305 0.1036306 -0.0001481 -0.1048494 -0.5208437 -0.0001169 0.000266 0.0001591 -0.2696516 -0.6259564 -0.1649882 0.0000338 -0.0985379 -0.5052499 0.0000897 0.0000256 0.0000085 -0.2614158 0.3385221 0.1288764 -0.0000403 0.3636043 -0.1354131 -0.0000464 0.0000066 0.0002209 0.0461839 0.3088621 0.0428593 0.0001263 -0.1633966 -0.1326805 -0.000042 0.0000217 0.0000899 -0.0034678 0.0266443 -0.106938 -0.0000782 -0.0812192 0.2601783 -0.0001904 0.000138 -0.0020039 -0.0660539 0.0746614 -0.0255857 0.0000014 0.0741095 0.4064374 -0.0000495 -0.0000419 -0.000241 -0.0417952 0.5812869 -0.10274 -0.0001453 0.0247359 0.8062583 -0.0001479 -0.0009657 -0.0003195 0.0331037 -0.026018 -0.0472986 0.000217 -0.0315627 -0.0071141 -0.000074 0.000168 0.0000256 -0.1922607 -0.0083612 0.1641558 -0.0001594 0.1005593 -0.1726101 0.0000148 -0.0001733 0.0001993 -0.2029485 0.0661958 0.0746618 0.0003286 0.0225953 -0.0834318 0.0000037 -0.0000469 0.0019011 0.0833005 0.0101837 -0.0668645 0.0000833 0.0076657 -0.167402 0.0000624 0.0001294 0.0003424 0.0827587 -0.1404864 0.0359747 -0.0000581 -0.0603255 0.0034343 0.0002177 0.0009474 0.0002783 0.0886189 0.2069658 0.0038622 0.0000493 -0.0123759 0.1340227 0.0000091 -0.0001893 0.0000184 0.3302985 -0.0903426 0.1001909 -0.000021 0.1066506 0.0223563 -0.0000526 0.0001174 -0.0001765 0.152118 -0.081078 -0.1025979 0.0000207 -0.1121435 0.0082784 -0.00002 0.0000558 -0.0000598 0.1534614 -0.1329665 -0.1460907 -0.002043 -0.0429015 0.0219577 -0.0003672 -0.0014437 -0.0012853 0.0998934 0.0406522 0.0591196 -0.0992891 0.0347834 -0.0211059 0.0423509 -0.0937162 0.1142767 -0.0428928 0.037258 0.0612493 0.1010206 0.0348278 -0.01943 -0.0415379 0.094991 -0.1131636 -0.0398235 -0.0363014 0.1260115 0.0002037 0.0310292 0.0917761 -0.0000267 0.000149 -0.0001558 0.1088751 0.0493946 -0.0493567 0.1031475 -0.0328925 -0.0235498 0.051289 0.093077 0.1170551 -0.0498346 0.0489032 -0.0496523 -0.1034178 -0.0329627 -0.023456 -0.0512113 -0.0932999 -0.1170141 -0.0494043 0.0794431 0.0139544 -0.000047 0.1124754 -0.0437586 0.0004797 -0.0003704 0.0004029 0.1294026 -0.0286062 -0.0261877 0.0287716 -0.0696911 0.0512021 0.1053427 0.1079096 0.0950807 -0.0447075 -0.0282261 -0.0262462 -0.0285562 -0.0701777 0.0501441 -0.1059769 -0.1077554 -0.0956392 -0.0437586 unknown
polarizability: 161.0562703|3.3769835|140.5403249|-0.0115427|-0.0168789|63.5085297 unknown
InChI: InChI=1S/C10H12N2/c1-6-4-5-7(2)10-9(6)11-8(3)12-10/h4-5,11H,1-3H3
charge 0 multiplicity 1
24 atoms
N  1.38908 1.160698 -0.000378
N  1.472337 -1.115246 -0.000214
C  0.045916 0.743235 -0.000254
C  0.118732 -0.692517 -0.000284
C  -1.172358 1.458994 -0.000158
C  -1.057687 -1.483301 -0.000305
C  2.20089 0.012438 -0.000385
C  -2.334435 0.650076 -0.000201
C  -2.280401 -0.77064 -0.000333
C  -1.248302 2.976963 -0.000553
C  -0.983584 -2.997366 -0.0002
C  3.697733 0.087403 -0.0008
H  1.72321 2.122407 -0.000522
H  -3.315269 1.142499 -0.000045
H  -3.220875 -1.335344 -0.00032
H  -0.249731 3.449966 0.007807
H  -1.780113 3.351607 -0.895074
H  -1.794618 3.35115 0.885305
H  0.067764 -3.326654 -0.001242
H  -1.481942 -3.42392 0.890728
H  -1.483906 -3.424168 -0.889897
H  4.100337 -0.936478 0.001719
H  4.083103 0.611124 -0.895971
H  4.083419 0.615776 0.891481
