program: Gaussian 09
title: 000260714
version: EM64L-G09RevD.01
frameworkgroup: C1[X(C8H13NO2)]
method: RPBEPBE
basis: SDD
operation: Freq
keyword: #p
keyword: freq=noraman
keyword: PBEPBE/SDD
title: #p freq=noraman PBEPBE/SDD
converged: YES YES NO NO
title: Mulliken charges:
elementType: O O N C C C C C C C C H H H H H H H H H H H H H
charge: -0.204295 -0.210152 0.064396 -0.245782 -0.119583 0.405220 -0.520681 -0.561168 -0.474563 -0.457924 -0.777904 0.287948 0.240271 0.252324 0.230277 0.213030 0.276360 0.232891 0.220233 0.206391 0.230857 0.252079 0.225127 0.234646
chargesum: 0.00000
title: Mulliken charges with hydrogens summed into heavy atoms:
elementType: O O N C C C C C C C C
charge: -0.204295 -0.210152 0.064396 0.042166 0.120688 0.405220 -0.038079 -0.071778 -0.021439 -0.020675 -0.066052
polarizability: 1.00323478e+02 -4.47360751e-01 9.26609534e+01 -1.60752600e+00 -4.63973673e+00 8.52525536e+01
1716.lowfreq: -19.0115 -15.3944 -0.0011 -0.0007 -0.0007 11.4853 31.8140 98.6900 178.6899
frequency: 31.7891 98.5437 178.6762 220.7623 237.5904 312.7757 326.0399 346.8915 402.5064 438.3801 462.3287 509.3378 573.4292 665.6319 703.4512 758.2181 768.7082 789.9833 805.8657 841.6811 888.4596 910.1335 926.5729 938.8253 954.9609 966.3310 985.7326 1004.1226 1051.4230 1081.1939 1106.3130 1109.6348 1132.7162 1172.0819 1184.8139 1207.4800 1220.2054 1224.1588 1243.3155 1258.1605 1270.7521 1290.3221 1295.7257 1314.6516 1319.7767 1386.1833 1397.1543 1460.0759 1463.8802 1472.5199 1475.3571 1486.3561 1502.7606 2998.8962 3000.7608 3015.9905 3018.3717 3020.7880 3055.0088 3072.3035 3078.9144 3084.2718 3088.6838 3090.4015 3092.0560 3113.7247
redmass: 9.6109 3.0712 3.3723 1.3241 2.7332 3.0702 2.3648 2.6797 2.0088 2.5391 2.7732 3.4616 4.1247 6.6464 3.5209 6.9051 3.7481 3.6666 1.4027 2.4163 2.5716 1.7423 2.6572 1.8630 2.0438 1.7453 1.7589 1.4433 1.4904 1.5112 1.2653 1.2826 1.5835 1.4820 2.1515 3.8358 4.4780 1.3853 1.4727 1.5079 1.4049 1.6887 1.4888 1.5950 1.5795 1.4375 4.0864 1.0906 1.0749 1.0652 1.0791 1.0825 1.0879 1.0371 1.0587 1.0609 1.0612 1.0626 1.1032 1.0906 1.1033 1.1015 1.1061 1.0912 1.0982 1.1000
irintensity: 0.0103 1.6684 2.7251 0.5644 1.7364 1.2960 1.7207 0.6555 1.6376 0.3541 0.9602 1.8600 2.3433 0.4029 0.7775 19.7257 13.4081 2.9024 1.9739 6.0739 4.1241 2.3330 2.2016 0.9465 0.7573 1.4636 4.1820 0.3302 0.5416 4.7794 11.1206 4.4315 4.3443 3.3811 8.3347 42.1919 23.4106 9.9538 2.1227 3.9275 2.8391 6.4060 3.0454 9.4076 16.7889 55.3868 106.0411 4.4886 15.3223 4.2189 15.3002 9.7909 7.7231 12.5281 37.3526 35.2296 40.0272 25.2915 8.5107 46.3191 17.3242 35.1235 37.1025 9.8475 13.9762 13.0607
temp: 298.150 k
press: 1.00000 atm
elementType: 8 8 7 6 6 6 6 6 6 6 6 1 1 1 1 1 1 1 1 1 1 1 1 1
symmnumber: 1
zpe: 531769.5 jmol-1
zpe.correction: 0.202540 hartree
zpe.thermalcorrener: 0.212347 hartree
zpe.thermalcorrenthalpy: 0.213291 hartree
zpe.thermalcorrgfe: 0.167188 hartree
zpe.sumelectzpe: -516.904540 hartree
zpe.sumelectthermal: -516.894734 hartree
zpe.sumelectthermalent: -516.893790 hartree
zpe.sumelectthermalfe: -516.939893 hartree
dipole: -4.0241 1.2294 0.9992
dipole: 4.3247
quadrupole: -75.3399 -66.3551 -64.9688
quadrupole: 2.7707 3.3625 2.1421
quadrupole: -6.4520 2.5329 3.9191 2.7707 3.3625 2.1421
hfenergy: -517.1070807 hartree
pointgroup: C01 [X(C8H13N1O2)]
dipole: -1.576225 -0.3692255 -0.5236146 debye
dipolederiv: -0.5255547 -0.2603018 -0.0350608 -0.0888812 -0.693123 0.2008053 -0.1729648 0.1017228 -0.2870172 -0.5780878 0.1490432 -0.2178949 -0.0232329 -0.5602241 0.1306586 -0.2034542 0.238674 -0.3945574 0.8127233 0.1611111 0.2866582 0.2084236 0.9306242 -0.3518118 0.4342666 -0.355198 0.321664 0.0785433 0.0177647 -0.0327474 -0.0035366 0.020066 -0.0334531 -0.1478623 -0.0318643 0.0365793 0.1429173 -0.0319386 -0.0091373 -0.0209466 0.1656415 -0.0120141 -0.0335556 -0.007648 0.0322846 0.1453236 -0.0864959 -0.0080506 -0.1020943 0.1202126 0.0399903 0.0080805 0.0516549 0.1931533 0.0451612 0.0300676 -0.0295112 0.0160912 -0.0438902 0.0055066 -0.0275741 -0.0178206 -0.0059227 -0.0974631 0.0217365 0.0020123 -0.0105597 -0.0769124 0.0304176 0.0381447 0.0360929 0.037562 -0.0089271 0.0042542 -0.0536714 -0.0336671 0.0556291 0.004072 0.0441067 0.0284627 0.0936469 0.0635969 -0.0474966 -0.0112587 -0.0385469 -0.0185843 0.043462 -0.0189231 0.0310852 0.102053 -0.0698814 0.0158992 -0.001147 0.0616158 -0.0150534 -0.0247143 0.0026894 -0.0543283 -0.0040561 0.0130819 0.0592944 -0.0641638 0.0421795 0.0129286 0.0721731 -0.0406756 0.0579411 -0.010451 -0.0008984 0.0783468 -0.0136987 0.089435 -0.1470151 0.0507942 -0.0124206 0.0473742 0.058621 -0.0447393 -0.1180786 -0.0791041 -0.088452 -0.0090202 -0.0427304 -0.0489233 -0.0120015 0.0581509 -0.0499681 0.0389965 0.1494001 0.0147854 0.0759832 0.0012367 0.112629 -0.024819 -0.0637462 0.0354757 0.0117453 -0.0610808 0.0099279 0.0680367 -0.0979607 -0.0274487 -0.042543 -0.1341222 0.0691191 -0.0806639 0.0609697 -0.0392466 0.0063727 0.0290922 0.0287815 -0.0162831 0.0998663 -0.0484906 -0.0463604 0.0926273 -0.016362 0.0375372 0.0411114 0.0935379 0.0892101 -0.0742786 0.0877732 0.0373576 -0.0122037 0.0277162 -0.115096 -0.0779977 -0.0245063 -0.1305582 -0.0034046 0.0599912 -0.0041804 -0.027473 -0.0208309 0.0380994 -0.0536739 -0.1005933 -0.0374446 -0.1636711 -0.1598072 0.051869 0.0557292 0.0633646 0.046726 -0.0026268 0.1176616 -0.0203082 0.031736 0.085624 0.0618344 -0.0222763 0.060043 -0.0156432 0.035153 -0.039556 0.099107 0.0331994 -0.0531785 -0.0641063 -0.0912138 -0.0627301 0.0585168 -0.0331314 -0.0934479 -0.0294674 0.0665198 -0.0023347 0.000302 0.1222966 -0.0444953 0.0581877 0.0456412 0.1120081 -0.0010407 -0.0238094 unknown
polarizability: 100.2002862|0.1148035|93.9896042|2.137691|-3.1820048|84.0470947 unknown
InChI: InChI=1S/C8H13NO2/c1-8(9(10)11)5-6-2-3-7(8)4-6/h6-7H,2-5H2,1H3
charge 0 multiplicity 1
24 atoms
O  2.291773 1.285138 -0.060681
O  2.425725 -0.742631 0.949001
N  1.821713 0.120311 0.208951
C  -0.516254 -0.540237 0.864504
C  -1.501786 1.187606 -0.256638
C  0.421865 -0.334518 -0.377214
C  -0.939979 0.927147 1.172181
C  -0.264666 0.840871 -1.142993
C  -1.868642 -1.146449 0.378502
C  -2.5499 0.042365 -0.396365
C  0.735513 -1.582812 -1.22187
H  -0.030354 -1.110005 1.670849
H  -1.905057 2.19529 -0.445111
H  -0.09996 1.59054 1.442123
H  -1.711094 0.987466 1.959882
H  -0.548486 0.534601 -2.165254
H  0.426452 1.697121 -1.219283
H  -2.465032 -1.441095 1.260597
H  -1.74132 -2.051226 -0.238923
H  -2.753034 -0.200006 -1.455284
H  -3.511071 0.325002 0.069439
H  1.143179 -2.395616 -0.598553
H  -0.183173 -1.936123 -1.718464
H  1.469189 -1.344141 -2.012795
