program: Gaussian 09
title: 000260711
version: EM64L-G09RevD.01
frameworkgroup: C1[X(C8H13N)]
method: RPBEPBE
basis: SDD
operation: Freq
keyword: #pfreq=noraman
keyword: PBEPBE/SDD
title: #p freq=noraman PBEPBE/SDD
converged: YES YES NO NO
title: Mulliken charges:
elementType: N C C C C C C C C H H H H H H H H H H H H H
charge: -0.034274 0.426046 -0.264218 -0.569710 -0.476905 -0.437890 -0.187623 -0.695061 -0.706916 0.267087 0.244104 0.253563 0.210311 0.234872 0.191381 0.218311 0.230427 0.216725 0.220341 0.219867 0.221366 0.218197
chargesum: 0.00000
title: Mulliken charges with hydrogens summed into heavy atoms:
elementType: N C C C C C C C C
charge: -0.034274 0.426046 0.002869 -0.072044 -0.031722 -0.028199 -0.187623 -0.027568 -0.047486
polarizability: 1.09228921e+02 4.22483835e+00 8.11941039e+01 -3.77511206e+00 -1.68289098e+00 7.31670552e+01
1716.lowfreq: -6.2476 -0.0005 0.0003 0.0005 4.7848 20.2680 77.7405 80.1674 124.4677
frequency: 77.6301 80.1447 124.4306 142.4431 204.0385 222.9914 257.0038 266.4318 311.6337 370.1646 391.4349 417.9163 536.6199 620.7450 665.9951 759.6337 778.7706 796.4864 842.3798 882.0755 917.5021 963.8267 1000.8697 1040.8731 1050.7753 1063.4132 1065.8811 1094.6548 1097.9728 1119.4007 1219.0028 1240.7001 1288.6975 1319.3690 1329.7729 1350.4939 1376.0153 1390.4498 1398.6044 1454.1981 1464.5039 1472.4243 1477.3473 1482.5774 1490.1148 1492.7746 2181.1488 2965.6897 2980.3787 2983.3269 2988.4239 3017.3531 3031.5836 3075.1581 3076.9164 3083.9502 3094.4059 3095.5416 3121.6946 3199.5673
redmass: 2.3660 2.4775 2.8505 3.0557 1.4427 2.0863 1.6454 1.8588 3.6748 1.9704 2.4227 4.5985 4.4444 4.3135 2.8249 1.3307 1.3598 1.6630 3.0013 1.6547 1.7671 1.8223 1.5800 1.8979 1.9318 1.3749 1.6650 1.5983 1.8932 1.8595 1.6523 1.4859 1.2586 1.5591 1.5120 1.5244 2.0122 1.2153 1.2448 1.1997 1.0667 1.0511 1.0619 1.0684 1.0651 1.0551 12.4633 1.0599 1.0602 1.0363 1.0367 1.1008 1.1005 1.0998 1.0992 1.1003 1.0974 1.0584 1.0878 1.1154
irintensity: 1.4533 1.2445 3.5763 1.6041 0.1878 0.4674 0.2073 0.2236 0.3859 0.2504 0.5380 2.2894 1.5724 0.9048 2.4276 2.0064 12.5661 2.5726 12.5248 1.4257 9.3692 4.1003 8.0154 10.9252 3.7198 12.7956 2.6652 7.5611 8.4996 1.9328 1.0613 0.0815 1.1637 0.3306 2.1447 1.2274 0.8101 6.1898 23.1216 12.4683 1.2422 3.2659 13.9438 13.6877 3.7193 17.5470 55.9794 34.3091 22.9156 26.0789 32.6634 19.3233 10.7967 45.6362 45.7279 51.3990 27.3940 14.0311 3.5736 8.0870
temp: 298.150 k
press: 1.00000 atm
elementType: 7 6 6 6 6 6 6 6 6 1 1 1 1 1 1 1 1 1 1 1 1 1
symmnumber: 1
zpe: 498282.5 jmol-1
zpe.correction: 0.189786 hartree
zpe.thermalcorrener: 0.200201 hartree
zpe.thermalcorrenthalpy: 0.201145 hartree
zpe.thermalcorrgfe: 0.154379 hartree
zpe.sumelectzpe: -366.647656 hartree
zpe.sumelectthermal: -366.637241 hartree
zpe.sumelectthermalent: -366.636297 hartree
zpe.sumelectthermalfe: -366.683062 hartree
dipole: -4.4047 -1.2722 0.8218
dipole: 4.6578
quadrupole: -73.1754 -52.6185 -55.1355
quadrupole: -1.9208 3.2577 0.0276
quadrupole: -12.8656 7.6913 5.1743 -1.9208 3.2577 0.0276
hfenergy: -366.8374417 hartree
pointgroup: C01 [X(C8H13N1)]
dipole: -1.7180971 0.5836267 -0.256219 debye
dipolederiv: -0.491289 -0.0171475 -0.0539906 0.1569213 -0.2453483 0.0387434 -0.0573249 0.0017372 -0.2494418 0.2347379 -0.0248006 0.0058833 0.0374617 0.0686476 0.042972 0.2260623 0.0429614 0.1646327 -0.4905412 0.0202752 -0.1334515 -0.004899 0.0838164 0.0074784 -0.1963289 0.0154481 0.0501938 0.1069043 -0.0162808 0.0942625 0.1080343 0.0234124 0.041491 -0.0388651 0.0016831 -0.1352836 -0.0021735 0.0089725 -0.0003 0.0780839 0.0896003 -0.033569 -0.0441407 -0.0150412 0.0887218 0.0926748 -0.0030966 -0.0235638 -0.0885605 0.0855465 0.007058 -0.0562107 0.0010325 0.1386002 0.4507383 -0.1134833 0.1029654 -0.3759995 -0.0025935 -0.0974897 0.1243135 -0.0559646 -0.0364045 0.0638026 -0.0401927 -0.0356893 -0.0737384 -0.0089839 -0.0306697 -0.0150357 -0.0321063 0.0282253 -0.0860131 -0.0086759 -0.0153928 0.041789 0.0663209 -0.0179909 0.0265116 -0.0229143 0.0571452 0.0310826 0.0199695 -0.0409015 0.0040349 -0.0408154 -0.0539447 -0.0480503 -0.042795 0.1009792 0.0444529 0.0668894 -0.0709106 0.0313901 -0.0302322 0.0751929 -0.0583053 0.0507506 0.0208464 0.0721023 0.0660298 0.024302 0.0597845 0.0188163 -0.0947805 0.0112237 -0.0527633 0.0014345 0.0415764 -0.0473476 0.0858105 -0.0401198 0.0365503 -0.0084366 0.0798118 0.0078679 -0.1532652 -0.0842415 0.0759096 -0.0369255 0.0539878 0.0130452 -0.0066937 -0.0075339 -0.0231275 0.0757899 0.0084689 -0.063885 0.0190045 -0.0482352 -0.171051 0.0320431 0.0140896 0.0801626 0.0617309 -0.000872 0.0046535 -0.0269005 0.0148232 0.0821797 0.0191708 0.0057397 -0.0200163 -0.1784488 -0.1535517 0.0379598 -0.0268904 0.0772842 0.0923202 0.0054412 -0.0151309 0.0036717 0.0699613 0.0361195 0.0033486 0.0923234 -0.0107533 0.0931192 0.0350345 0.0611222 -0.0190989 -0.1370953 0.0742747 0.0015405 -0.0089556 -0.0380491 -0.1922107 0.0444816 -0.0176926 0.070109 0.0717293 0.0797917 -0.0163795 0.001608 -0.0262 0.0919535 -0.0074588 -0.0575051 -0.0096529 -0.1574681 0.0695378 -0.0558977 -0.0094909 -0.100583 -0.1168715 0.0706249 -0.0038614 0.0910248 0.0551715 -0.0975828 0.1016388 0.0572036 0.143543 -0.0372219 -0.068698 0.0671111 -0.0729687 0.0622452 unknown
polarizability: 108.9687592|-5.4173949|81.7592497|3.0947415|-0.7827401|72.8620712 unknown
InChI: InChI=1S/C8H13N/c1-3-8(4-2)5-7(8)6-9/h7H,3-5H2,1-2H3
charge 0 multiplicity 1
22 atoms
N  3.230707 -0.410185 0.392165
C  -0.407462 0.197523 0.054035
C  0.987798 0.911105 -0.041599
C  0.146608 0.60843 -1.308978
C  -0.439092 -1.298668 0.416219
C  -1.502735 1.086234 0.666741
C  2.216748 0.192891 0.193046
C  -1.251412 -2.18632 -0.557448
C  -2.945634 0.721633 0.250038
H  1.016031 1.955318 0.290077
H  -0.290555 1.469951 -1.824302
H  0.526523 -0.17166 -1.975193
H  -0.848188 -1.40089 1.441011
H  0.595062 -1.690991 0.461677
H  -1.308202 2.140833 0.382924
H  -1.418583 1.041172 1.771501
H  -2.311756 -1.887067 -0.610574
H  -0.837103 -2.134256 -1.580726
H  -1.212492 -3.242954 -0.234961
H  -3.055933 0.711519 -0.849983
H  -3.242219 -0.271142 0.631509
H  -3.660711 1.459722 0.657018
