program: Gaussian 09
title: 000260695
version: EM64L-G09RevD.01
frameworkgroup: C1[X(C22H27Cl2N)]
method: RPBEPBE
basis: SDD
operation: Freq
keyword: #p
keyword: freq=noraman
keyword: PBEPBE/SDD
title: #p freq=noraman PBEPBE/SDD
converged: YES YES NO NO
title: Mulliken charges:
elementType: Cl Cl N C C C C C C C C C C C C C C C C C C C C C C H H H H H H H H H H H H H H H H H H H H H H H H H H H
charge: -0.061668 -0.061687 -0.173652 0.154675 0.136271 0.335556 0.442496 -0.524826 -0.517875 -0.448339 -0.416634 -0.388667 -0.390789 0.309213 -0.377431 -0.382558 -0.696427 -0.698098 -0.585189 -0.584779 -0.393032 -0.419446 -0.234291 -0.231231 -0.244702 0.247671 0.204526 0.246476 0.205505 0.233492 0.248677 0.247466 0.248357 0.248961 0.247583 0.229627 0.230046 0.228633 0.215762 0.220611 0.215032 0.217880 0.232743 0.294879 0.268066 0.294660 0.267945 0.246308 0.235528 0.225148 0.223986 0.227541
chargesum: 0.00000
title: Mulliken charges with hydrogens summed into heavy atoms:
elementType: Cl Cl N C C C C C C C C C C C C C C C C C C C C C C
charge: -0.061668 -0.061687 -0.173652 0.154675 0.136271 0.335556 0.442496 -0.072629 -0.065894 -0.214847 -0.167957 0.107156 0.105756 0.309213 -0.147804 -0.152512 -0.031420 -0.032443 -0.022244 -0.022173 -0.146725 -0.183918 -0.009142 -0.007245 -0.017162
polarizability: 4.09614499e+02 3.29813047e+00 2.56780422e+02 2.61242925e+00 2.32820691e+01 1.83015327e+02
1716.lowfreq: -12.9423 -4.2450 -0.0026 -0.0020 -0.0019 2.2602 8.3643 20.7717 23.6104
frequency: -2.5319 20.7146 23.5688 26.8333 30.5744 40.6748 48.7533 56.5118 59.8987 77.6675 92.7799 113.1428 120.6196 136.6539 147.9007 175.6363 180.2516 197.8222 208.1845 217.0540 240.4295 244.5635 254.2861 268.5704 296.5877 301.8954 338.9246 383.8569 396.2262 402.5319 413.2115 430.7939 487.4609 514.6024 522.3019 536.4784 564.3060 586.2068 614.4583 626.0848 636.1064 665.6431 677.6477 692.9628 706.3089 724.6873 738.8355 769.5671 772.7734 782.6399 784.2611 790.4756 814.0183 819.3633 834.4805 854.2137 908.9440 923.1270 941.6182 948.2987 953.5480 961.0868 975.4343 988.2519 992.8554 996.7160 997.9157 1012.0742 1027.5104 1034.9970 1035.5657 1041.4147 1050.6631 1059.2527 1074.8697 1084.1696 1109.8850 1115.3780 1119.7241 1136.4209 1170.8705 1179.4925 1185.6561 1209.5127 1222.9626 1244.4883 1251.1061 1253.9775 1255.5148 1276.1749 1279.3466 1285.3157 1292.5436 1306.9263 1308.3503 1315.8639 1326.9689 1350.1541 1352.7769 1358.0273 1366.7811 1383.0429 1383.7316 1385.8853 1422.8362 1428.0840 1458.1150 1460.1213 1464.1905 1467.2968 1471.7497 1472.2455 1477.4602 1482.6279 1484.4404 1485.2077 1502.1776 1511.5174 1555.5808 1579.7166 1606.2789 1623.9517 1638.6126 2965.0531 2971.9537 2978.8395 2979.8658 3011.1812 3016.1643 3058.9867 3059.3530 3063.7580 3064.0575 3067.6517 3073.1589 3074.5860 3075.1118 3087.0367 3088.9242 3117.9877 3121.8309 3123.6253 3128.5451 3135.3085 3144.4991 3148.7110 3149.3909 3153.0726 3158.4668 3161.8689
redmass: 4.6246 5.1598 6.1734 4.0974 11.2369 3.8955 4.0679 4.1280 3.6504 3.2534 3.1864 2.7440 3.0109 2.7891 3.4834 3.5839 3.7186 1.3464 4.2947 1.3833 5.2368 4.4616 3.5583 2.1768 2.8686 2.7944 3.3005 4.2185 3.6633 2.8512 3.2003 2.9370 3.3856 3.3270 4.1942 4.2574 3.5174 3.1742 5.7916 4.7851 5.9282 5.1856 3.9498 5.2030 1.6179 3.4292 3.2940 2.6191 1.8675 1.1897 1.2335 1.1639 1.2880 1.6137 1.8712 1.2452 1.9596 1.5946 1.4195 2.2717 2.1702 1.4542 1.3832 6.1953 1.3068 2.9926 1.4350 2.4891 2.0422 3.8790 2.2759 2.1963 1.8967 2.6844 1.6353 1.8448 1.8921 2.1112 1.4676 1.4595 1.0528 1.6452 1.1147 1.1292 2.1694 1.8356 1.3016 1.1638 1.1621 1.3494 1.7937 2.3651 1.1943 1.4581 1.3678 1.4964 1.3607 1.4232 1.4402 3.5761 6.3215 1.1988 1.2102 1.7165 3.3332 2.2514 1.0942 1.0956 1.0837 1.0765 1.0672 1.0442 2.1432 1.0867 1.0664 1.0598 1.1635 2.3695 6.6689 5.9306 6.1702 6.3637 8.9139 1.0671 1.0662 1.0351 1.0351 1.0601 1.0610 1.0929 1.0934 1.0610 1.0604 1.0965 1.1029 1.1001 1.1000 1.0997 1.0994 1.0847 1.0872 1.0880 1.0878 1.0919 1.0964 1.1110 1.1116 1.0947 1.0950 1.1016
irintensity: 0.0058 0.0223 0.0383 0.0893 0.7768 0.1650 1.0866 0.5340 0.7631 0.4809 0.3700 1.7156 0.8487 0.9813 0.1620 0.4808 1.2329 0.5058 3.0304 0.0904 13.8889 2.3047 0.9658 0.3767 3.6653 0.4313 2.4992 12.5132 3.1511 0.1934 0.6494 1.1644 2.7874 14.9402 3.6149 16.5005 1.2165 11.7636 0.8867 3.9738 7.1793 46.7072 27.6915 86.2389 56.3104 20.5331 6.8121 4.6330 54.4261 2.0622 2.3818 9.4838 5.9402 52.5693 25.3841 0.0079 9.4495 1.3285 0.3856 8.6525 10.6546 6.4806 0.1509 0.9864 0.1198 0.7850 3.6547 4.8045 10.1050 0.4436 0.0310 0.4435 0.9839 5.4726 7.3037 12.8472 13.2512 2.8010 35.8963 9.1813 0.0100 82.6810 0.4556 22.9345 35.8084 3.1970 0.8284 20.5036 16.9822 48.6302 15.6024 3.8994 8.7466 1.1220 2.4580 5.4043 26.9535 36.0686 51.2724 0.8201 1.0360 24.0775 0.5451 58.9432 4.4856 6.4994 12.8164 11.6003 5.3112 2.7362 4.7420 7.3784 7.9579 26.3721 12.9630 6.2650 4.8236 295.3577 4.1920 1.7648 20.4174 161.6820 8.0238 23.5201 20.8656 53.3288 22.7033 27.0323 17.3088 2.2774 9.0023 12.3034 11.1904 15.5464 13.1200 37.9701 38.9324 51.9824 69.8535 6.4116 0.3325 12.6603 21.4423 14.4889 41.1709 1.1612 21.4758 33.8229 11.5882 31.3840
temp: 298.150 k
press: 1.00000 atm
elementType: 17 17 7 6 6 6 6 6 6 6 6 6 6 6 6 6 6 6 6 6 6 6 6 6 6 1 1 1 1 1 1 1 1 1 1 1 1 1 1 1 1 1 1 1 1 1 1 1 1 1 1 1
symmnumber: 1
zpe: 1134474.9 jmol-1
zpe.correction: 0.432099 hartree
zpe.thermalcorrener: 0.457814 hartree
zpe.thermalcorrenthalpy: 0.458758 hartree
zpe.thermalcorrgfe: 0.372389 hartree
zpe.sumelectzpe: -1827.541664 hartree
zpe.sumelectthermal: -1827.515949 hartree
zpe.sumelectthermalent: -1827.515004 hartree
zpe.sumelectthermalfe: -1827.601373 hartree
dipole: 0.8881 -0.0877 0.0597
dipole: 0.8944
quadrupole: -167.9846 -175.0881 -165.3616
quadrupole: -1.1585 0.5759 1.5038
quadrupole: 1.4935 -5.6100 4.1165 -1.1585 0.5759 1.5038
hfenergy: -1827.9737623 hartree
pointgroup: C01 [X(C22H27Cl2N1)]
dipole: -0.3503 0.0206689 0.0262699 debye
polarizability: 409.4787689|4.0530831|261.5064682|5.3031251|13.2526678|178.4250114 unknown
InChI: InChI=1S/C22H27Cl2N/c1-3-21(18-8-6-5-7-9-18)22(4-2)19-10-12-20(13-11-19)25(16-14-23)17-15-24/h5-13H,3-4,14-17H2,1-2H3
charge 0 multiplicity 1
52 atoms
Cl 5.790043 -3.709402 -1.090132
Cl 6.365489 3.358987 1.055284
N  4.208293 -0.047448 0.061778
C  -1.583233 0.376166 0.415791
C  -2.458368 -0.217338 -0.464943
C  -0.091337 0.251865 0.288424
C  2.796964 0.050832 0.138662
C  -2.042543 1.153451 1.65206
C  -2.020566 -0.990985 -1.710742
C  0.733607 1.403945 0.200218
C  0.572206 -1.003227 0.318441
C  4.890225 -1.349404 0.138762
C  5.052111 1.150072 -0.081262
C  -3.952369 -0.112104 -0.307964
C  2.136743 1.317167 0.121734
C  1.97416 -1.111523 0.241359
C  -1.695207 0.418042 2.974043
C  -2.494923 -0.322295 -3.028481
C  4.931922 -2.028835 -1.243495
C  5.325607 1.794818 1.291072
C  -4.633237 1.125382 -0.467783
C  -4.727994 -1.27526 -0.052275
C  -6.040017 1.201832 -0.359056
C  -6.134358 -1.201709 0.063584
C  -6.797214 0.038301 -0.08936
H  -3.129859 1.332754 1.615541
H  -1.551954 2.148357 1.664786
H  -0.922741 -1.090832 -1.733759
H  -2.438636 -2.018612 -1.67084
H  0.269435 2.397148 0.178518
H  -0.023434 -1.918015 0.418196
H  5.923596 -1.199387 0.498443
H  4.396463 -2.014046 0.869841
H  4.58341 1.887412 -0.756912
H  6.013076 0.865804 -0.545473
H  2.708583 2.247345 0.050649
H  2.416806 -2.11192 0.267067
H  -0.608738 0.237381 3.058831
H  -2.014158 1.015388 3.848002
H  -2.209028 -0.559487 3.020599
H  -2.173807 -0.918715 -3.902288
H  -2.06533 0.691337 -3.12842
H  -3.594913 -0.231157 -3.061368
H  3.928099 -2.237796 -1.639723
H  5.523373 -1.455395 -1.972618
H  4.403195 2.118987 1.793293
H  5.914709 1.140498 1.950774
H  -4.051421 2.027441 -0.690618
H  -4.222872 -2.240764 0.072011
H  -6.544163 2.166452 -0.488828
H  -6.711452 -2.109707 0.2733
H  -7.88814 0.0960 -0.003622
