program: Gaussian 09
title: 000260691
version: EM64L-G09RevD.01
frameworkgroup: C1[X(C21H28O2)]
method: RPBEPBE
basis: SDD
operation: Freq
keyword: #pfreq=noraman
keyword: PBEPBE/SDD
title: #p freq=noraman PBEPBE/SDD
converged: YES YES NO NO
title: Mulliken charges:
elementType: O O C C C C C C C C C C C C C C C C C C C C C H H H H H H H H H H H H H H H H H H H H H H H H H H H H
charge: -0.175985 -0.268018 -0.158878 0.316753 -0.106450 -0.627660 -0.172020 0.278148 -0.522418 0.004233 -0.488165 -0.510086 -0.803011 0.254836 -0.581412 -0.752221 -0.746316 0.301372 -0.372091 -0.546354 -0.415412 0.318946 -0.535883 0.221794 0.240763 0.219718 0.225893 0.208513 0.213231 0.224823 0.222122 0.197488 0.218430 0.216263 0.226512 0.241135 0.236991 0.222569 0.228054 0.215508 0.240352 0.212664 0.219692 0.244586 0.215805 0.221046 0.254442 0.238612 0.219023 0.219084 0.242980
chargesum: 0.00000
title: Mulliken charges with hydrogens summed into heavy atoms:
elementType: O O C C C C C C C C C C C C C C C C C C C C C
charge: -0.175985 -0.268018 0.062916 0.316753 0.134313 -0.182049 0.036493 0.278148 -0.084364 0.004233 -0.068555 -0.075393 -0.098374 0.254836 -0.130789 -0.083697 -0.066233 0.301372 -0.151045 -0.291913 -0.176800 0.318946 0.145203
polarizability: 3.11249664e+02 -7.10572872e+00 2.12042470e+02 6.02241958e+00 5.71883994e+00 1.55515413e+02
1716.lowfreq: -7.6133 -0.0008 0.0004 0.0007 5.6147 12.2563 26.6295 53.1903 70.7412
frequency: 26.4576 53.0630 70.7269 75.8565 96.2689 103.5009 156.5701 166.9370 174.9184 189.5692 201.5555 210.0668 221.5806 224.7877 236.0531 247.1972 260.1507 267.1770 280.9425 286.8910 301.8023 333.9044 359.8253 367.4890 378.2412 395.6694 405.0240 435.2516 442.4566 484.5808 493.4829 512.9805 535.9249 540.8322 565.9146 594.3404 604.2527 632.3156 694.3407 709.9256 718.3004 743.3401 775.1971 785.1269 810.9065 822.0091 844.1385 860.1634 866.6538 886.0972 893.1521 914.8870 926.4938 933.6162 943.3558 946.1757 976.4346 980.7599 995.3840 1003.8504 1008.4520 1016.6237 1026.3796 1047.4195 1067.3835 1081.3293 1105.2307 1112.1652 1117.7483 1124.5492 1131.3690 1143.8400 1146.0131 1154.8116 1176.6850 1183.5217 1195.5883 1208.2958 1216.3108 1222.7392 1229.0278 1242.8010 1248.4249 1251.1404 1256.7860 1275.6797 1285.2694 1290.8504 1293.1303 1314.5420 1322.9607 1328.7029 1334.8368 1339.3287 1351.9806 1367.3287 1373.6026 1380.4526 1388.0139 1390.0359 1422.7884 1437.1642 1456.8139 1457.4430 1462.5438 1465.9157 1468.1501 1469.8367 1473.1776 1475.2832 1475.4139 1476.1393 1486.5180 1491.2165 1493.1017 1494.5639 1576.5667 1624.5840 1647.3338 2897.5328 2909.9062 2956.2220 2958.7549 2959.7306 2972.0531 2973.9228 2976.2618 2977.4918 2984.8289 2987.9379 2992.8769 3019.8310 3034.4894 3035.3645 3042.3189 3046.8968 3051.2091 3067.9585 3072.6354 3080.1859 3082.0628 3086.4345 3095.4264 3121.6672 3136.7701 3139.0628 3164.0337
redmass: 3.9048 4.4866 3.7225 3.2916 4.2709 3.3652 2.3843 3.2430 3.1688 1.5605 1.3925 1.8209 1.7662 2.2596 1.2798 1.5821 2.1654 2.7058 2.4553 3.8285 2.7336 2.7882 3.0816 3.1996 2.7017 2.4245 3.2537 3.6039 2.7834 2.6633 4.0695 3.1853 3.4182 4.2408 2.7547 3.6633 3.5580 3.0644 3.0018 5.0001 3.4916 5.9047 2.5394 2.7767 1.6857 1.9196 2.0284 2.0984 2.8868 3.2307 1.6094 1.8676 1.9031 1.4463 1.5948 1.5008 1.8168 1.8536 1.6373 3.7972 1.7831 2.3785 1.7616 2.4429 2.5764 2.0086 2.4138 1.2689 2.0232 2.7370 1.5317 1.7268 1.5064 1.7925 1.6842 1.4582 1.9886 1.7218 2.2259 2.0843 1.8112 1.8849 3.1454 1.7236 1.7898 1.4104 1.4378 1.5167 1.3974 1.3782 1.3487 1.5294 1.4536 1.4391 1.4911 1.2288 3.6840 1.5608 1.2100 1.2106 3.1337 1.2509 1.0560 1.1254 1.0701 1.0505 1.0508 1.0917 1.0861 1.0770 1.0752 1.0594 1.0589 1.0699 1.0595 2.4765 7.0761 6.7927 11.3788 1.0801 1.0797 1.0331 1.0655 1.0750 1.0690 1.0349 1.0381 1.0586 1.0600 1.0574 1.0413 1.0937 1.0991 1.1007 1.1037 1.1018 1.1019 1.1003 1.0991 1.0999 1.0993 1.0998 1.0981 1.0991 1.0903 1.0875 1.0947
irintensity: 0.0955 1.9495 2.1336 4.6790 1.2021 2.0938 0.8721 1.0284 0.5892 0.5531 0.4230 0.6297 0.2520 0.7563 2.0359 0.1030 1.7271 0.0463 0.6654 7.9355 2.1868 1.1895 0.4508 0.6224 0.8462 0.4311 0.1329 0.1270 5.9524 1.6619 2.3251 3.0568 0.6479 9.2050 2.9005 3.8410 1.4536 3.1293 3.9659 3.3743 1.0508 0.3184 11.1430 1.6193 24.1059 5.8547 4.6499 4.0296 5.7264 9.9802 27.9532 3.3215 4.7601 0.2719 2.2888 1.2804 5.0794 15.7142 35.8625 77.4274 54.0177 0.6206 0.9391 7.2597 7.8041 0.8074 13.2674 0.1865 1.3597 8.9654 3.1064 2.2568 13.4977 7.6199 41.7801 2.2016 4.1113 13.5384 10.7506 23.4086 5.7018 9.4996 99.5288 24.4358 1.5827 21.8647 9.1110 0.7954 0.2849 0.4918 1.1485 2.1170 1.1545 1.4516 2.8179 16.0712 9.6231 4.8683 20.3123 19.8857 25.8459 2.1080 7.1979 9.1337 4.4516 12.6906 6.7589 6.6733 8.2697 48.1124 11.2734 7.6667 19.5882 2.9438 14.9587 108.8619 25.7691 73.4099 142.1322 13.1053 17.9786 79.1380 26.7616 4.0118 35.7962 32.5315 18.2907 45.9919 25.6877 26.4564 30.1562 34.4073 8.7213 73.0752 51.1753 38.8195 38.6051 25.4804 54.3902 11.9925 18.9355 33.8066 26.8872 30.1812 15.9423 3.7982 18.5458
temp: 298.150 k
press: 1.00000 atm
elementType: 8 8 6 6 6 6 6 6 6 6 6 6 6 6 6 6 6 6 6 6 6 6 6 1 1 1 1 1 1 1 1 1 1 1 1 1 1 1 1 1 1 1 1 1 1 1 1 1 1 1 1
symmnumber: 1
zpe: 1153766.2 jmol-1
zpe.correction: 0.439446 hartree
zpe.thermalcorrener: 0.461353 hartree
zpe.thermalcorrenthalpy: 0.462297 hartree
zpe.thermalcorrgfe: 0.390319 hartree
zpe.sumelectzpe: -965.746800 hartree
zpe.sumelectthermal: -965.724894 hartree
zpe.sumelectthermalent: -965.723950 hartree
zpe.sumelectthermalfe: -965.795928 hartree
dipole: 2.1520 1.0549 0.2266
dipole: 2.4074
quadrupole: -141.2826 -137.8665 -138.7814
quadrupole: -23.2598 -2.6613 -0.1924
quadrupole: -1.9725 1.4437 0.5288 -23.2598 -2.6613 -0.1924
hfenergy: -966.1862464 hartree
pointgroup: C01 [X(C21H28O2)]
dipole: 0.8531687 0.4011296 0.0907941 debye
polarizability: 310.978848|-8.7242066|212.2809821|6.2859505|5.6981037|155.5477168 unknown
InChI: InChI=1S/C21H28O2/c1-20(2)12-18-17-7-5-13-11-14(23-4)6-8-15(13)16(17)9-10-21(18,3)19(20)22/h6,8,11,16-18H,5,7,9-10,12H2,1-4H3
charge 0 multiplicity 1
51 atoms
O  -4.719847 -1.751833 -0.220142
O  6.087073 0.370901 0.278591
C  -1.906517 0.463867 -0.231889
C  -2.42733 -0.910631 0.287449
C  -0.425567 0.685543 0.121218
C  -2.999345 1.471682 0.208435
C  0.407563 -0.455917 -0.549997
C  -4.33906 0.709325 -0.071757
C  -1.647883 -2.047129 -0.406328
C  -3.927848 -0.796575 -0.029506
C  -0.11987 -1.875856 -0.179614
C  0.128549 2.050474 -0.337758
C  -2.352269 -1.068916 1.841681
C  1.913199 -0.267592 -0.297714
C  1.561206 2.248956 0.196851
C  -5.45291 0.993881 0.965531
C  -4.874598 1.015156 -1.501106
C  2.451811 1.019866 0.017367
C  2.818731 -1.349719 -0.417707
C  3.842972 1.173697 0.19734
C  4.211767 -1.202447 -0.236997
C  4.726228 0.077983 0.07475
C  7.037074 -0.735566 0.157087
H  -1.95486 0.411819 -1.345184
H  -0.297216 0.625209 1.22351
H  -2.904946 1.716928 1.284421
H  -2.953249 2.423016 -0.351098
H  0.238024 -0.33625 -1.646765
H  -1.865926 -2.024986 -1.493307
H  -1.979853 -3.035398 -0.036438
H  0.141931 -2.096857 0.873825
H  0.400434 -2.637149 -0.790881
H  -0.518266 2.873786 0.020935
H  0.12258 2.091306 -1.446613
H  -2.843452 -0.237294 2.376837
H  -2.857692 -2.00656 2.135023
H  -1.307562 -1.119607 2.19011
H  1.508171 2.488324 1.279769
H  2.037645 3.124005 -0.285546
H  -5.766228 2.053216 0.910708
H  -6.333893 0.357322 0.767219
H  -5.110444 0.79166 1.997091
H  -4.090396 0.890076 -2.270252
H  -5.709253 0.33618 -1.749956
H  -5.238875 2.058026 -1.549969
H  2.438521 -2.347012 -0.661564
H  4.266848 2.155528 0.437191
H  4.866698 -2.072562 -0.341542
H  7.02166 -1.172359 -0.86087
H  6.83117 -1.529237 0.902062
H  8.023899 -0.290978 0.353799
