program: Gaussian 09
title: 000260690
version: EM64L-G09RevD.01
frameworkgroup: C1[X(C18H26O2)]
method: RPBEPBE
basis: SDD
operation: Freq
keyword: #pfreq=noraman
keyword: PBEPBE/SDD
title: #p freq=noraman PBEPBE/SDD
converged: YES YES NO NO
title: Mulliken charges:
elementType: O O C C C C C C C C C C C C C C C C C C H H H H H H H H H H H H H H H H H H H H H H H H H H
charge: -0.462985 -0.181251 0.279665 -0.264723 0.221306 -0.611567 -0.061439 -0.522979 -0.091355 -0.441253 -0.613098 -0.500734 -0.174952 -0.519860 0.305679 -0.518026 -0.547534 0.036869 -0.508165 -0.798136 0.242214 0.224095 0.242439 0.228558 0.204113 0.202507 0.233780 0.221943 0.198933 0.251646 0.232599 0.205606 0.229231 0.225398 0.203428 0.216292 0.215372 0.224737 0.327307 0.231822 0.216586 0.247690 0.245755 0.234154 0.228684 0.239650
chargesum: 0.00000
title: Mulliken charges with hydrogens summed into heavy atoms:
elementType: O O C C C C C C C C C C C C C C C C C C
charge: -0.135678 -0.181251 0.279665 -0.022509 0.221306 -0.145033 0.167119 -0.116359 0.142425 -0.020378 -0.128853 -0.065896 0.050446 -0.100141 0.305679 -0.077917 -0.099125 0.036869 -0.014721 -0.095648
polarizability: 2.18649913e+02 -2.15641443e+00 1.75352856e+02 2.98709684e+00 -8.86843810e-01 1.53581528e+02
1716.lowfreq: -16.4992 -11.9084 -7.2792 0.0008 0.0010 0.0010 46.4177 57.4285 89.3590
frequency: 46.3042 57.3374 89.3319 121.8843 136.9225 165.1391 190.7490 206.2225 211.7811 220.9834 243.8216 254.2909 273.7538 285.6240 301.7779 321.7378 343.4911 373.3344 387.9346 405.9896 409.6404 416.3311 455.4593 467.4999 516.5236 521.7823 536.2699 559.0993 570.7471 606.9598 632.9029 665.4697 695.9459 708.6008 773.1848 797.5869 811.9457 821.8199 824.1364 839.7479 843.6834 872.5755 900.9265 904.3125 919.4422 933.6590 945.9054 946.9935 964.3122 980.6669 983.2147 992.5088 1002.9732 1020.0495 1029.8457 1035.3823 1045.9491 1057.9813 1061.3700 1074.8533 1084.2885 1085.5918 1099.3735 1120.7416 1133.4792 1140.8962 1156.6750 1168.3814 1169.9972 1185.3160 1197.3222 1201.5049 1225.6909 1235.1119 1238.5625 1241.3512 1245.5473 1255.6152 1263.0898 1271.0868 1286.1366 1293.3876 1298.5216 1307.6535 1311.6614 1317.3886 1327.3097 1328.6084 1340.4639 1342.8520 1348.4802 1367.9545 1372.5997 1383.3832 1428.7417 1452.0582 1459.8066 1461.7442 1469.4501 1471.6891 1473.2602 1474.7185 1481.9141 1489.4403 1491.2710 1653.8839 2909.4717 2957.2890 2968.6159 2976.1164 2977.1248 2979.4615 2980.1597 2989.6978 2992.2707 2997.7088 3004.6624 3015.7366 3026.9230 3029.9514 3041.3504 3045.2332 3051.6972 3055.5240 3071.3907 3079.4442 3079.9219 3083.0701 3093.2663 3133.2894 3179.2527 3540.2568
redmass: 3.4386 5.1163 3.4716 2.8876 3.8731 1.5388 2.1536 2.9263 2.0239 2.2199 3.1459 2.2119 2.3106 3.7724 1.8825 1.6476 2.5227 2.3332 3.2085 2.8423 3.2055 3.0360 3.2709 2.9536 2.6568 3.5671 2.3266 3.2639 3.5915 4.3175 2.4595 2.8150 2.9119 3.1334 1.7808 2.2588 2.0517 2.1007 1.9003 2.0053 1.8539 2.1140 2.5207 2.4390 1.6597 1.7210 2.2839 1.9702 2.0862 2.0995 2.0362 1.9270 1.8885 1.7469 1.3906 2.5581 1.8613 2.2173 1.8744 2.4783 2.1487 1.8791 2.0512 2.3438 1.9542 1.5632 1.4512 1.7833 1.6970 1.5362 1.4012 1.7527 1.8031 1.4060 1.5874 1.6587 1.4278 1.6773 1.4203 1.4446 1.4789 1.5953 1.4086 1.4559 1.3389 1.4214 1.3449 1.5216 1.3901 1.7929 1.5766 2.2054 1.5990 1.2021 1.0807 1.2058 1.0759 1.0803 1.1048 1.0890 1.0759 1.0877 1.1084 1.0606 1.0776 12.0605 1.0809 1.0796 1.0685 1.0644 1.0653 1.0621 1.0682 1.0383 1.0618 1.0595 1.0653 1.0651 1.1014 1.0971 1.0965 1.1019 1.1035 1.0984 1.1021 1.0778 1.0990 1.0804 1.0981 1.0932 1.1140 1.0652
irintensity: 0.0944 2.2982 2.5635 0.2760 2.3309 0.3165 0.0350 2.3976 1.1780 0.5314 0.5918 0.3386 1.7275 7.1330 43.9955 46.4004 8.5760 0.9695 6.7352 2.9702 0.2954 1.1073 7.9320 1.4235 2.4508 3.1842 0.4993 4.0697 4.0476 0.4422 1.7479 2.4501 0.1887 5.5052 6.7223 9.3376 0.4781 14.4100 2.8957 6.3838 4.5205 17.3677 30.0673 0.9210 8.1471 5.3078 2.5724 0.9223 8.7039 4.6265 9.3833 22.6718 12.3235 17.9303 24.2545 1.1251 13.4504 11.0538 6.2394 16.2171 2.4401 8.0806 25.5316 6.0439 1.8270 7.6550 1.5172 5.4725 6.3002 6.5286 1.0534 5.3771 9.5335 6.9338 4.9899 5.9896 2.5285 2.5456 1.1989 15.1564 0.8337 3.2702 3.6801 8.2944 1.7676 1.5127 0.1725 0.1103 9.7708 28.1526 2.7085 2.5398 3.0992 21.7344 18.4591 2.9769 9.1737 0.2848 8.1093 19.2592 4.0945 7.9940 6.7833 7.3882 10.9014 193.2231 16.2520 1.0847 18.5409 48.4695 22.8936 42.8277 31.2617 15.6078 70.3240 29.2507 18.7741 10.7354 8.7840 40.1832 40.0911 28.9256 53.6668 12.2224 40.6507 3.3338 16.7555 44.8146 29.0088 20.0345 18.6365 4.6530
temp: 298.150 k
press: 1.00000 atm
elementType: 8 8 6 6 6 6 6 6 6 6 6 6 6 6 6 6 6 6 6 6 1 1 1 1 1 1 1 1 1 1 1 1 1 1 1 1 1 1 1 1 1 1 1 1 1 1
symmnumber: 1
zpe: 1053907.4 jmol-1
zpe.correction: 0.401412 hartree
zpe.thermalcorrener: 0.419432 hartree
zpe.thermalcorrenthalpy: 0.420376 hartree
zpe.thermalcorrgfe: 0.357526 hartree
zpe.sumelectzpe: -850.386869 hartree
zpe.sumelectthermal: -850.368849 hartree
zpe.sumelectthermalent: -850.367905 hartree
zpe.sumelectthermalfe: -850.430755 hartree
dipole: 3.6694 1.9622 1.6778
dipole: 4.4866
quadrupole: -132.6339 -120.1797 -122.7147
quadrupole: -10.9464 -2.1945 -0.8588
quadrupole: -7.4578 4.9964 2.4614 -10.9464 -2.1945 -0.8588
hfenergy: -850.7882813 hartree
pointgroup: C01 [X(C18H26O2)]
dipole: 1.4515759 0.7927883 0.6166217 debye
polarizability: 218.6748363|-2.2225251|175.2592447|2.5790225|-1.7826022|153.6502161 unknown
InChI: InChI=1S/C18H26O2/c1-16-7-6-14-12(13(16)2-3-15(16)19)5-8-17-10-11(17)4-9-18(14,17)20/h11-14,20H,2-10H2,1H3
charge 0 multiplicity 1
46 atoms
O  2.393096 -0.035691 -2.021311
O  -4.720912 -1.198244 -0.170445
C  2.502703 0.715686 0.31176
C  3.899101 0.319509 0.831529
C  2.02217 -0.416274 -0.615677
C  2.703541 0.35099 1.796449
C  0.467324 -0.518376 -0.665956
C  2.011825 2.107929 -0.085004
C  -0.185066 0.770862 -0.051077
C  4.241105 -1.066653 0.260348
C  2.868131 -1.653979 -0.204161
C  0.529532 2.035083 -0.588924
C  -1.690762 0.698167 -0.359362
C  -0.158704 -1.813784 -0.084251
C  -2.348249 -0.563586 0.290046
C  -1.702371 -1.846547 -0.277859
C  -2.655105 1.856774 0.009997
C  -3.833211 -0.321925 -0.039068
C  -4.056292 1.20345 -0.175308
C  -2.289451 -0.57013 1.853304
H  4.696361 1.059125 0.955434
H  2.324465 -0.59279 2.203184
H  2.653531 1.188066 2.500808
H  0.222643 -0.50419 -1.749349
H  2.648968 2.536835 -0.881266
H  2.087594 2.787306 0.785555
H  -0.044373 0.751497 1.049724
H  4.738356 -1.721324 0.999647
H  4.936389 -0.960846 -0.597221
H  2.968938 -2.355097 -1.049948
H  2.389844 -2.203999 0.62499
H  -0.015604 2.946634 -0.27813
H  0.518161 2.004815 -1.695566
H  -1.78388 0.559668 -1.462614
H  0.086819 -1.91142 0.992724
H  0.281941 -2.697028 -0.58546
H  -1.931971 -1.919844 -1.360003
H  -2.133622 -2.745925 0.200817
H  3.364024 0.169083 -2.035709
H  -2.521328 2.740032 -0.637776
H  -2.50204 2.188382 1.054285
H  -4.463284 1.395528 -1.187178
H  -4.824715 1.546378 0.540947
H  -1.25328 -0.664089 2.217818
H  -2.7186 0.345722 2.297482
H  -2.86624 -1.432779 2.232873
