program: Gaussian 09
title: 000260687
version: EM64L-G09RevD.01
frameworkgroup: C1[X(C17H14ClNO)]
method: RPBEPBE
basis: SDD
operation: Freq
keyword: #p
keyword: freq=noraman
keyword: PBEPBE/SDD
title: #p freq=noraman PBEPBE/SDD
converged: YES YES NO NO
title: Mulliken charges:
elementType: Cl O N C C C C C C C C C C C C C C C C C H H H H H H H H H H H H H H
charge: -0.053167 -0.413459 -0.349242 0.265330 0.366829 0.303945 -0.411372 0.317994 -0.417701 -0.816164 0.131417 -0.288983 -0.354917 -0.410964 -0.352602 -0.109739 -0.209903 -0.240598 -0.231414 -0.247544 0.253229 0.247753 0.256067 0.238477 0.232168 0.292989 0.243414 0.242064 0.226593 0.257737 0.221389 0.222436 0.226457 0.361482
chargesum: 0.00000
title: Mulliken charges with hydrogens summed into heavy atoms:
elementType: Cl O N C C C C C C C C C C C C C C C C C
charge: -0.053167 -0.051977 -0.349242 0.265330 0.366829 0.303945 -0.158143 0.317994 -0.169948 -0.089451 0.131417 0.004006 -0.111503 -0.168900 -0.126008 -0.109739 0.047833 -0.019209 -0.008978 -0.021087
polarizability: 2.15791720e+02 -1.39316089e+01 2.43321666e+02 -2.42918548e+01 -1.23602650e+01 1.60209344e+02
1716.lowfreq: -10.1847 -4.5076 -0.0014 -0.0012 0.0015 3.8679 26.6490 35.0542 59.8944
frequency: 26.6217 35.0318 59.8780 74.5569 90.1859 109.0619 134.3803 157.4037 179.7582 218.8062 222.3678 252.4193 294.1796 307.1915 329.1621 353.3133 358.2660 360.5536 400.2109 408.1651 437.1015 480.2051 505.7956 532.8307 579.0206 613.3767 617.7615 630.1013 644.6356 659.0756 692.4943 701.1488 710.9887 733.6310 763.1909 780.0697 792.8779 816.3063 846.9058 847.8995 888.3153 913.0691 921.0524 924.2761 972.2738 976.3921 987.2613 990.0499 1006.7521 1025.7235 1043.3304 1049.0958 1076.7346 1080.8996 1087.4418 1104.2673 1156.1709 1171.1360 1190.7313 1213.4061 1247.1423 1266.4891 1278.8134 1306.9027 1320.0661 1340.9541 1362.8111 1379.4740 1383.6630 1402.3547 1414.2921 1437.3174 1462.4583 1468.4925 1480.4671 1491.1030 1531.4791 1567.1611 1581.5360 1594.0553 1605.6222 1614.4320 2972.4206 3047.3423 3094.9088 3121.8343 3126.8722 3129.0824 3143.9943 3153.2100 3165.7655 3176.5058 3178.5444 3204.3886 3224.9145 3580.4110
redmass: 8.8118 4.3412 4.6963 4.0470 5.2006 5.2015 4.5168 1.2476 3.5814 4.0565 5.0445 5.4875 3.8560 5.2880 4.7706 1.4859 3.3665 5.2458 4.8524 2.8872 3.6426 3.4221 3.6484 3.7230 4.1650 5.8344 4.9201 4.6324 5.9652 4.7800 4.6672 1.9006 5.6019 4.0136 1.6262 1.4305 1.4920 6.9794 1.2604 1.3691 1.4208 1.4982 1.5946 3.1276 1.4560 1.6547 5.4613 1.3160 3.7496 2.3012 1.3580 1.4508 2.2035 1.6473 2.0627 2.0812 1.1906 1.0535 1.1171 1.6358 2.5023 1.7615 2.1445 2.0119 2.4733 4.6520 3.3316 7.0832 5.4073 1.2874 3.9121 2.4580 1.0713 2.4073 1.1965 2.9717 5.5522 5.2377 6.1199 6.9474 7.4093 6.2041 1.0386 1.0970 1.0970 1.0843 1.0900 1.0876 1.0928 1.0954 1.1010 1.0945 1.0943 1.0922 1.1037 1.0662
irintensity: 0.1033 0.3894 0.7262 0.6440 1.8708 0.6850 0.1112 0.1861 0.2272 3.0689 1.4967 1.6192 5.9300 0.8153 1.5667 69.1844 31.7269 9.3616 0.4691 0.1868 5.2952 14.1694 6.6961 18.7782 3.6740 0.3785 15.6323 4.2925 19.4678 2.8949 3.7284 52.9875 6.1136 10.1521 106.5022 25.7604 44.7841 7.4552 0.1287 0.1729 17.7978 6.0638 1.0832 2.6186 0.1438 1.4324 1.3577 0.4286 18.1144 9.5588 30.3305 4.6777 5.5740 13.7822 80.2118 81.1858 38.0282 0.0501 2.4225 16.9494 18.7066 16.0050 23.7941 1.5051 27.6120 15.8125 32.3860 5.7518 36.5760 8.0173 56.8191 21.0731 18.0789 19.9131 23.3239 134.9545 77.1394 7.9668 1.4230 2.9786 23.0591 48.1639 46.2595 15.2323 18.6775 4.3390 11.1748 3.4842 24.0736 40.4658 16.5361 1.6395 0.9091 9.3018 4.1585 44.1532
temp: 298.150 k
press: 1.00000 atm
elementType: 17 8 7 6 6 6 6 6 6 6 6 6 6 6 6 6 6 6 6 6 1 1 1 1 1 1 1 1 1 1 1 1 1 1
symmnumber: 1
zpe: 684219.6 jmol-1
zpe.correction: 0.260605 hartree
zpe.thermalcorrener: 0.278138 hartree
zpe.thermalcorrenthalpy: 0.279082 hartree
zpe.thermalcorrgfe: 0.214246 hartree
zpe.sumelectzpe: -1244.845737 hartree
zpe.sumelectthermal: -1244.828205 hartree
zpe.sumelectthermalent: -1244.827260 hartree
zpe.sumelectthermalfe: -1244.892096 hartree
dipole: -2.7684 0.4633 2.5868
dipole: 3.8171
quadrupole: -112.8577 -123.2948 -114.5073
quadrupole: -7.4240 -14.8365 -4.2587
quadrupole: 4.0289 -6.4082 2.3793 -7.4240 -14.8365 -4.2587
hfenergy: -1245.1063422 hartree
pointgroup: C01 [X(C17H14Cl1N1O1)]
dipole: 0.8834344 -0.117048 -1.2087733 debye
polarizability: 210.4458667|17.4840941|239.6585896|-33.6868296|6.0388326|169.2182739 unknown
InChI: InChI=1S/C17H14ClNO/c1-12-7-9-15(13-5-3-2-4-6-13)19(12)16-11-14(18)8-10-17(16)20/h2-11,20H,1H3
charge 0 multiplicity 1
34 atoms
Cl 2.299841 -3.38954 1.578031
O  1.497114 0.982354 -2.496009
N  0.393862 1.262658 0.075335
C  -0.959593 1.265165 0.515747
C  0.957512 2.542703 0.281994
C  1.155435 0.099318 -0.276802
C  -1.228612 2.560593 0.985198
C  -1.88405 0.12624 0.394074
C  -0.040573 3.350856 0.838836
C  2.391583 2.856205 -0.028338
C  1.73142 -0.044283 -1.569618
C  1.338348 -0.928774 0.677366
C  -1.845698 -0.782418 -0.702767
C  -2.893915 -0.059218 1.382479
C  2.48745 -1.197537 -1.886478
C  2.079067 -2.073483 0.336744
C  2.663739 -2.22447 -0.934394
C  -2.772934 -1.84138 -0.797188
C  -3.828789 -1.109731 1.278251
C  -3.770215 -2.013413 0.190946
H  -2.201717 2.905101 1.332197
H  0.082712 4.40033 1.102264
H  2.598019 2.784257 -1.112154
H  2.618617 3.884292 0.298261
H  3.092641 2.175217 0.492231
H  0.890392 -0.818689 1.668218
H  -1.109174 -0.639502 -1.499887
H  -2.926945 0.618726 2.242794
H  2.931798 -1.30592 -2.883736
H  3.240572 -3.119874 -1.180959
H  -2.724955 -2.527027 -1.650989
H  -4.594943 -1.232094 2.052453
H  -4.489668 -2.836127 0.114729
H  1.885959 0.75756 -3.37763
