program: Gaussian 09
title: 000260670
version: EM64L-G09RevD.01
frameworkgroup: C1[X(C15H9Cl2NO2)]
method: RPBEPBE
basis: SDD
operation: Freq
keyword: #p
keyword: freq=noraman
keyword: PBEPBE/SDD
title: #p freq=noraman PBEPBE/SDD
converged: YES YES NO NO
title: Mulliken charges:
elementType: Cl Cl O O N C C C C C C C C C C C C C C C H H H H H H H H H
charge: -0.048948 -0.043066 -0.147548 -0.248032 -0.446538 0.374059 0.265210 0.212520 0.216317 -0.304973 -0.524639 -0.455501 0.707802 -0.370990 -0.396511 -0.446423 -0.204449 -0.103563 0.222062 -0.794014 0.328672 0.300536 0.262087 0.302402 0.261089 0.322602 0.244184 0.271458 0.244196
chargesum: 0.00000
title: Mulliken charges with hydrogens summed into heavy atoms:
elementType: Cl Cl O O N C C C C C C C C C C C C C C C
charge: -0.048948 -0.043066 -0.147548 -0.248032 -0.123936 0.374059 0.265210 0.212520 0.216317 -0.304973 -0.195968 -0.154966 0.707802 -0.108903 -0.094109 -0.446423 0.056640 -0.103563 0.222062 -0.034176
polarizability: 3.70484389e+02 5.50748358e-01 2.24013980e+02 1.22275918e-03 -7.92013568e-04 7.52598517e+01
1716.lowfreq: -59.0810 -1.9442 -0.0014 -0.0012 0.0009 1.6702 2.6904 42.0187 48.8915
frequency: -59.0680 42.0184 48.8912 68.9924 80.3101 105.5106 144.3939 147.7733 155.1021 198.9911 211.2823 228.6342 244.4302 288.4565 293.7448 320.1804 370.4456 395.8421 421.2785 427.0442 450.7525 500.5578 505.0695 538.1870 577.1325 584.6122 592.2224 632.7432 652.1306 687.9901 695.2162 728.8252 733.3715 770.3645 771.3388 815.6026 842.9112 886.7726 908.2936 931.5804 933.8833 951.0276 951.9540 963.5401 989.5792 1031.2975 1034.6016 1055.4517 1094.3592 1135.3693 1170.9154 1198.0734 1224.7503 1237.5490 1254.4282 1282.1210 1353.4608 1376.3755 1381.4502 1401.3677 1429.4841 1444.1904 1461.1688 1466.8807 1477.5993 1503.4926 1588.9901 1591.8884 1597.9608 1613.0999 1636.2280 1640.1543 2991.1138 3075.9717 3139.6585 3148.6138 3168.5972 3169.1922 3174.0366 3182.0530 3473.1916
redmass: 1.0479 13.5991 5.8426 5.6299 7.4759 6.5313 8.7159 6.6724 5.3963 14.7848 5.7987 11.6255 10.1737 6.1375 5.6269 6.4202 6.3711 8.9883 6.9563 3.6103 3.2332 4.8660 5.7457 5.4791 3.0950 5.6936 8.1587 4.3681 6.5541 7.8578 1.8724 6.3409 2.2096 6.5583 3.2811 3.3490 1.4968 5.5067 1.3918 1.7548 6.4077 1.4821 6.3173 1.3981 1.8602 2.5383 1.6724 1.8645 3.6872 2.3205 2.3055 2.9543 1.9908 1.5176 1.7614 2.7716 5.8086 4.3367 1.2441 4.1898 3.1361 1.3185 2.5164 1.0460 5.8870 2.1317 7.0289 8.6061 7.7750 7.9989 9.6237 5.2750 1.0386 1.0982 1.0982 1.0900 1.0935 1.0937 1.0962 1.0935 1.0764
irintensity: 0.3035 1.2274 1.7810 9.5988 1.3959 0.0099 5.3078 0.8046 0.0188 0.6649 1.5177 0.4161 0.3700 1.4646 0.2227 1.1453 0.1132 37.2259 3.6558 9.2296 8.8840 9.8819 2.1613 5.6780 1.8522 4.8457 8.3344 4.9854 3.9018 85.1841 33.9734 0.7821 32.1299 2.7824 5.3938 30.2307 30.9876 1.0743 0.2115 19.1405 3.3426 34.8922 12.8765 1.6350 51.0532 17.2716 8.9268 26.4407 8.5714 83.5954 189.4297 30.7055 50.0445 84.6247 136.7558 85.9682 111.4857 33.8609 67.1087 101.1877 118.4157 46.5393 82.1982 20.9881 1.3780 556.5573 16.9205 96.7445 196.6500 137.1366 21.8116 111.7752 4.3956 11.0100 6.1667 3.3037 1.1548 1.2804 3.9632 12.2418 49.7628
temp: 298.150 k
press: 1.00000 atm
elementType: 17 17 8 8 7 6 6 6 6 6 6 6 6 6 6 6 6 6 6 6 1 1 1 1 1 1 1 1 1
symmnumber: 1
zpe: 526321.7 jmol-1
zpe.correction: 0.200465 hartree
zpe.thermalcorrener: 0.216944 hartree
zpe.thermalcorrenthalpy: 0.217888 hartree
zpe.thermalcorrgfe: 0.155160 hartree
zpe.sumelectzpe: -1700.981329 hartree
zpe.sumelectthermal: -1700.964851 hartree
zpe.sumelectthermalent: -1700.963907 hartree
zpe.sumelectthermalfe: -1701.026635 hartree
dipole: 4.9094 -2.2543 0.0003
dipole: 5.4022
quadrupole: -112.2618 -139.2548 -130.7275
quadrupole: 3.4261 0.0003 -0.0002
quadrupole: 15.1529 -11.8401 -3.3128 3.4261 0.0003 -0.0002
hfenergy: -1701.1817946 hartree
pointgroup: C01 [X(C15H9Cl2N1O2)]
dipole: -2.0060943 0.7020775 0.0003835 debye
polarizability: 369.096388|14.2012177|225.4018269|0.0701416|0.1466927|75.2600059 unknown
InChI: InChI=1S/C15H9Cl2NO2/c1-7(19)18-14-6-10-9-3-2-8(16)4-11(9)15(20)12(10)5-13(14)17/h2-6,18H,1H3
charge 0 multiplicity 1
29 atoms
Cl -3.734685 -2.638608 -0.00336
Cl 6.012899 1.31602 0.002314
O  2.099738 -3.028662 -0.002682
O  -3.184874 2.67535 0.001719
N  -3.641964 0.36798 -0.000455
C  0.083784 -0.033013 -0.000123
C  1.460986 0.526937 0.00068
C  0.180095 -1.456398 -0.001485
C  2.387503 -0.558415 -0.000189
C  1.623616 -1.860687 -0.001572
C  -1.159723 0.610345 0.000256
C  -0.968803 -2.261775 -0.002489
C  -2.346692 -0.188399 -0.000743
C  1.930221 1.851591 0.002042
C  3.774602 -0.355521 0.000273
C  -2.213411 -1.611681 -0.002095
C  3.331688 2.080536 0.002528
C  4.22184 0.985481 0.00165
C  -4.015236 1.72364 0.000766
C  -5.525885 1.935993 0.000589
H  -1.269836 1.696176 0.00127
H  -0.894851 -3.352761 -0.003524
H  1.243581 2.704289 0.002726
H  4.471073 -1.198819 -0.000397
H  3.725885 3.100824 0.00358
H  -4.404561 -0.318596 -0.001262
H  -5.993585 1.485613 -0.894334
H  -5.72918 3.016049 0.001285
H  -5.993923 1.484409 0.894729
