program: Gaussian 09
title: 000260639
version: EM64L-G09RevD.01
frameworkgroup: C1[X(C15H14O3)]
method: RPBEPBE
basis: SDD
operation: Freq
keyword: #pfreq=noraman
keyword: PBEPBE/SDD
title: #p freq=noraman PBEPBE/SDD
converged: YES YES NO NO
title: Mulliken charges:
elementType: O O O C C C C C C C C C C C C C C C H H H H H H H H H H H H H H
charge: -0.395904 -0.153164 -0.138635 -0.154341 0.320612 0.180188 0.305374 0.036385 -0.215476 -0.328447 -0.175318 -0.206055 -0.696395 -0.686317 -0.376612 -0.370600 -0.221149 -0.231363 0.220235 0.271270 0.267365 0.223995 0.223261 0.206237 0.205010 0.235979 0.219330 0.287305 0.290700 0.240037 0.242514 0.373981
chargesum: 0.00000
title: Mulliken charges with hydrogens summed into heavy atoms:
elementType: O O O C C C C C C C C C C C C C C C
charge: -0.021923 -0.153164 -0.138635 0.065894 0.320612 0.180188 0.305374 0.036385 0.055794 -0.061083 -0.175318 -0.206055 -0.042902 -0.025998 -0.089307 -0.079900 0.018888 0.011151
polarizability: 2.81557115e+02 1.69706677e+01 2.01026077e+02 -4.99208604e+00 -3.45456916e+00 8.94452056e+01
1716.lowfreq: -7.5442 -0.0008 -0.0006 -0.0004 4.8797 11.7168 24.2057 44.0207 53.5298
frequency: 23.3598 44.0175 53.5221 62.4954 114.2803 126.7186 142.3419 185.3420 204.0471 214.8661 227.3981 260.4544 288.6366 306.1857 352.0685 353.9906 371.8873 398.5484 403.7349 428.8245 448.7412 464.7513 476.7913 511.7874 567.5037 625.3476 636.0520 662.1672 681.0743 706.7492 731.7060 789.1365 817.5220 851.5805 867.2731 879.5807 917.0708 925.7281 941.0067 948.1390 952.9951 977.8897 990.2713 1001.5310 1010.1107 1039.9894 1083.4679 1101.6848 1134.9513 1162.6111 1175.2988 1181.7829 1206.9022 1219.4882 1253.9985 1279.0752 1292.6476 1295.1048 1301.6560 1349.7899 1375.2928 1391.5034 1395.4898 1398.8113 1437.8928 1466.0152 1466.2758 1478.7744 1483.5830 1487.1386 1535.3500 1567.1710 1576.1953 1595.9053 1614.7409 1637.8229 2970.3518 2975.4285 2990.8524 3040.0500 3064.0618 3072.6027 3077.0768 3086.9014 3110.6693 3139.4400 3153.1851 3167.4484 3182.3440 3382.8084
redmass: 3.1186 4.2329 11.1738 3.6890 3.8530 3.9239 4.7285 5.5724 1.0313 2.9657 1.5324 3.2863 2.4498 3.3140 4.9085 7.8050 3.6907 4.8121 4.9560 4.3618 3.6596 7.9683 3.2774 5.4641 4.9384 6.9369 1.3156 5.1107 3.6343 6.3069 3.7403 1.4571 2.6595 2.3820 3.7161 2.7535 1.1908 1.8725 1.8177 5.1076 1.4549 1.6778 1.4004 2.0231 1.3686 2.0299 2.6587 2.5260 2.1192 2.4971 1.1223 1.8929 1.6038 2.7147 1.4757 1.6841 2.7667 1.2968 1.3672 1.7517 1.1955 1.5731 7.5470 1.7445 2.4482 1.0509 1.0446 1.0501 2.8804 1.0570 12.8675 7.9141 8.4164 7.3642 7.9894 6.2103 1.0354 1.0358 1.0841 1.0903 1.0994 1.0987 1.1003 1.1000 1.0886 1.0864 1.0912 1.0972 1.0968 1.0645
irintensity: 0.2105 0.9523 0.0308 1.1932 0.9976 1.0945 0.3958 0.0889 0.0065 1.2494 0.8220 1.3257 0.7102 2.3426 10.3019 1.5995 0.3305 1.4681 3.6982 5.2535 9.1342 1.2463 4.4356 5.3164 2.4571 4.6837 43.6469 7.5489 56.7491 3.6162 4.1864 61.5750 11.3689 6.9648 5.4415 0.0702 1.7619 5.3317 35.5102 15.1208 0.2761 9.2790 4.8836 51.0732 0.0215 2.6011 10.3852 2.6852 13.5339 11.0397 2.2026 23.8881 108.4156 27.3639 32.9216 18.8931 70.6788 5.4767 6.4172 15.1029 15.9385 6.2348 3.6658 31.2770 13.4183 3.8058 3.5667 12.8058 35.6051 15.9724 282.5691 33.5808 92.1101 11.0206 11.2416 3.2434 30.5231 38.9881 9.6765 10.4279 7.4692 90.3035 38.2494 36.5652 14.1904 3.3273 5.6040 17.7888 8.0026 52.5769
temp: 298.150 k
press: 1.00000 atm
elementType: 8 8 8 6 6 6 6 6 6 6 6 6 6 6 6 6 6 6 1 1 1 1 1 1 1 1 1 1 1 1 1 1
symmnumber: 1
zpe: 654027.5 jmol-1
zpe.correction: 0.249106 hartree
zpe.thermalcorrener: 0.265801 hartree
zpe.thermalcorrenthalpy: 0.266746 hartree
zpe.thermalcorrgfe: 0.203809 hartree
zpe.sumelectzpe: -804.360420 hartree
zpe.sumelectthermal: -804.343724 hartree
zpe.sumelectthermalent: -804.342780 hartree
zpe.sumelectthermalfe: -804.405717 hartree
dipole: 1.2378 -6.2987 0.1141
dipole: 6.4202
quadrupole: -81.9741 -120.9118 -106.4822
quadrupole: 8.2717 -1.9721 -0.1488
quadrupole: 21.1486 -17.7891 -3.3595 8.2717 -1.9721 -0.1488
hfenergy: -804.6095258 hartree
pointgroup: C01 [X(C15H14O3)]
dipole: -0.4330709 2.4884833 0.0077976 debye
polarizability: 282.3141835|15.2982296|200.4068274|3.4497642|1.4452354|89.3073876 unknown
InChI: InChI=1S/C15H14O3/c1-9(2)7-8-12-13(16)10-5-3-4-6-11(10)14(17)15(12)18/h3-9,16H,1-2H3
charge 0 multiplicity 1
32 atoms
O  -0.534189 1.965601 -0.354373
O  -0.463769 -2.860404 -0.280332
O  2.317358 -2.777043 0.073004
C  -4.509241 0.1839 -0.015338
C  1.55318 0.832586 -0.048149
C  -0.616429 -0.462752 -0.204758
C  2.327928 -0.362171 0.053677
C  0.092866 0.738981 -0.189425
C  -3.011562 0.312831 0.185578
C  -2.082892 -0.529979 -0.363905
C  0.120734 -1.738942 -0.175752
C  1.667086 -1.699184 -0.008501
C  -5.091555 1.475875 -0.65007
C  -5.208915 -0.12714 1.335571
C  2.20228 2.091338 -0.006261
C  3.732654 -0.281251 0.199701
C  3.605169 2.159565 0.138784
C  4.373617 0.974982 0.243809
H  -4.696127 -0.661355 -0.707427
H  -2.70762 1.095114 0.903933
H  -2.438364 -1.389824 -0.947985
H  -4.638007 1.679212 -1.637107
H  -6.184726 1.382833 -0.786672
H  -4.908648 2.352464 0.001209
H  -5.042558 0.690165 2.06336
H  -4.82302 -1.062333 1.777938
H  -6.299842 -0.23442 1.191284
H  1.602043 3.001072 -0.086844
H  4.298521 -1.215855 0.271919
H  4.099818 3.136121 0.170975
H  5.461038 1.033695 0.356577
H  -1.500927 1.820019 -0.565417
