program: Gaussian 09
title: 000260637
version: EM64L-G09RevD.01
frameworkgroup: C1[X(C13H10O3)]
method: RPBEPBE
basis: SDD
operation: Freq
keyword: #pfreq=noraman
keyword: PBEPBE/SDD
title: #p freq=noraman PBEPBE/SDD
converged: YES YES NO NO
title: Mulliken charges:
elementType: O O O C C C C C C C C C C C C C H H H H H H H H H H
charge: -0.401252 -0.161967 -0.138498 0.322665 0.193794 0.300378 0.051278 -0.611427 -0.172112 -0.202276 -0.371992 -0.372219 -0.220537 -0.230551 -0.090006 -0.583094 0.284062 0.240973 0.289083 0.291158 0.239787 0.242360 0.258298 0.374205 0.230839 0.237051
chargesum: 0.00000
title: Mulliken charges with hydrogens summed into heavy atoms:
elementType: O O O C C C C C C C C C C C C C
charge: -0.027047 -0.161967 -0.138498 0.322665 0.193794 0.300378 0.051278 -0.086393 -0.172112 -0.202276 -0.082909 -0.081061 0.019250 0.011809 0.168292 -0.115204
polarizability: 2.16832882e+02 -7.66443646e+00 1.85044069e+02 5.73252348e+00 2.68113551e+00 7.02387452e+01
1716.lowfreq: -4.2088 -0.0011 -0.0008 -0.0003 4.6249 8.0342 49.8019 62.1523 93.2382
frequency: 49.7883 62.1411 93.2296 102.0288 129.5096 179.8141 195.9393 242.6562 276.9511 310.8554 356.7352 359.7497 380.8710 401.2445 414.2079 443.5959 456.6757 488.2489 555.3059 587.4634 641.1637 660.6267 672.3720 683.7649 720.2277 735.1978 791.0535 823.3770 864.4954 898.3686 928.6469 932.7357 947.7247 961.2279 991.2830 1005.1146 1010.9832 1024.1731 1040.9998 1078.6800 1111.0046 1152.2304 1175.4363 1209.8402 1222.4697 1231.4000 1271.4930 1283.0930 1290.4027 1319.4722 1395.1302 1398.7774 1425.6597 1438.0065 1455.9673 1484.8398 1531.1489 1570.9385 1580.3589 1604.0643 1616.5740 1635.2555 2970.3961 3025.9108 3084.8721 3096.5820 3138.9555 3152.7842 3167.2491 3182.4124 3198.6364 3295.3941
redmass: 7.4014 5.2801 2.9965 3.5406 4.4889 6.0933 3.3429 3.7031 6.1639 4.6371 4.8847 8.1911 3.4707 8.8128 4.1909 4.0459 4.2960 4.4359 4.4718 2.6357 4.1568 3.9785 1.6926 2.7737 2.5316 3.4597 1.4786 3.9595 3.0852 1.9069 2.0965 3.0828 2.6913 1.3688 1.3983 3.0738 1.3675 1.2325 2.0455 2.7731 1.7213 2.7470 1.0809 1.7900 1.6554 1.9842 1.5796 1.5911 1.4151 2.5209 9.5655 2.3914 1.1983 2.3727 1.1173 2.8668 12.5309 8.7908 7.4412 7.6023 7.9789 4.4380 1.0596 1.0993 1.0611 1.0923 1.0864 1.0912 1.0973 1.0966 1.1142 1.0668
irintensity: 0.1259 1.1385 2.7612 2.2458 0.3105 2.0021 2.6636 1.4479 5.1703 1.5670 1.0830 2.4393 4.5066 4.5369 1.5347 8.9226 3.6085 0.4331 8.2261 16.0711 14.7473 22.8003 20.6622 31.5913 45.4503 1.1201 63.2516 2.0987 3.6580 16.9071 4.0500 23.0586 8.5892 56.5583 4.6862 31.7167 0.0285 30.2904 4.1585 14.9996 1.3684 24.5024 1.3555 32.6493 76.6121 65.7238 18.5301 25.3705 21.2329 52.3120 9.3558 57.1414 5.6021 7.6460 18.4973 29.2778 308.4208 15.5127 98.1850 33.8305 4.1009 27.8698 23.5370 10.1949 8.6948 9.1520 3.5249 5.4310 17.6508 8.0579 17.8099 469.0196
temp: 298.150 k
press: 1.00000 atm
elementType: 8 8 8 6 6 6 6 6 6 6 6 6 6 6 6 6 1 1 1 1 1 1 1 1 1 1
symmnumber: 1
zpe: 509704.8 jmol-1
zpe.correction: 0.194136 hartree
zpe.thermalcorrener: 0.207622 hartree
zpe.thermalcorrenthalpy: 0.208566 hartree
zpe.thermalcorrgfe: 0.153722 hartree
zpe.sumelectzpe: -725.906817 hartree
zpe.sumelectthermal: -725.893331 hartree
zpe.sumelectthermalent: -725.892387 hartree
zpe.sumelectthermalfe: -725.947231 hartree
dipole: -0.7185 -6.3665 0.0769
dipole: 6.4073
quadrupole: -72.5680 -108.4748 -91.7586
quadrupole: -0.1392 0.3428 -0.7431
quadrupole: 18.3657 -17.5410 -0.8248 -0.1392 0.3428 -0.7431
hfenergy: -726.1009531 hartree
pointgroup: C01 [X(C13H10O3)]
dipole: 0.0044125 -2.4839659 0.4295479 debye
dipolederiv: -0.7952872 -0.5079857 0.0788642 -0.2586198 -1.1059139 0.1054711 0.0796288 0.0360082 -0.3670412 -0.6080806 0.3196478 -0.059181 0.1963241 -0.9364508 0.1032989 -0.0469409 0.1139588 -0.3219358 -0.4487543 -0.2164909 0.0182559 0.0120534 -0.8370048 0.0673956 -0.0161647 0.0477321 -0.2909545 -0.0873004 -0.1795963 0.0215106 -0.159759 0.1019372 -0.0155959 -0.0179544 -0.0097844 0.0137092 -0.0135564 0.0602531 0.0292363 0.2971541 -0.9498759 0.149472 0.1285668 0.1425338 -0.1656899 -0.3517529 0.2548734 -0.0534795 0.2364493 -0.352457 0.0587394 -0.059633 0.0653937 0.0177738 0.845019 0.1184121 0.0307636 0.1608447 1.1945356 -0.1601037 0.0023103 -0.113443 0.1111019 -0.0016016 -0.0454608 0.0105526 -0.3174995 -0.1361371 0.0926338 0.0357087 0.0763519 0.088146 0.2137289 -0.0371318 0.0155395 -0.2875947 1.2998126 -0.1728512 0.055317 -0.1463879 0.1931023 0.6577142 -0.030854 0.0329374 -0.2494747 1.0333002 -0.1158144 0.0638894 -0.1146493 0.1724939 -0.2232189 0.2643706 -0.0363981 0.0863142 -0.0352822 -0.0048307 -0.0074014 0.006943 -0.1248799 -0.0875257 -0.0290151 0.0048096 0.1955635 0.0718492 -0.0067625 -0.0154477 -0.021772 -0.0912636 0.1446006 -0.2053228 0.042215 -0.0952489 0.0787157 -0.0313795 0.0292905 -0.038258 -0.1243742 0.1242295 0.023335 0.0163441 -0.1025172 -0.0834942 -0.0139244 0.0298396 -0.0069276 -0.150772 -0.1983926 0.1199642 -0.0398718 0.4234301 0.2029239 -0.0171389 -0.2493449 -0.0987503 0.1782121 -0.3966149 0.1262126 0.0374903 0.067155 -0.2667463 -0.0007751 0.0727483 -0.00788 0.0936068 0.1365123 -0.0179294 0.0215839 0.170517 0.0661314 -0.008101 0.06003 0.0183846 0.0968771 -0.0571102 -0.023711 -0.0416312 -0.0762105 0.0586264 -0.0982646 -0.02742 -0.0259349 -0.0755447 0.1116593 -0.0645296 0.0019787 -0.0477857 0.0188329 0.0154034 0.0042305 0.0124351 0.1569013 0.0909251 -0.0092126 -0.0027673 -0.073421 0.0195408 0.0115585 0.0041893 0.0142125 0.1532574 0.0144131 0.0868699 -0.0191166 0.1078659 -0.0360878 0.0298507 -0.0228754 0.0293272 0.1502724 -0.1121208 -0.002708 -0.0173868 -0.0152672 0.0941415 0.006878 -0.0172286 0.0076297 0.1591187 0.1485426 -0.0309026 -0.0411112 -0.0545294 0.0579597 -0.0421453 0.0136493 -0.0146266 -0.0900329 0.6237975 0.1572509 -0.0924221 -0.0472139 0.2510625 0.0003678 -0.1296509 0.0023054 0.315838 0.1084794 -0.0859782 0.0561087 -0.1239275 0.0748329 0.0621684 0.0651876 0.0700412 -0.0089681 0.161695 -0.0443608 -0.0148248 -0.0446023 0.1152472 -0.0155507 -0.0345243 -0.044843 -0.0889539 unknown
polarizability: 217.9959751|-2.7052194|181.8959125|7.7871434|-14.634088|72.2238088 unknown
InChI: InChI=1S/C13H10O3/c1-2-5-10-11(14)8-6-3-4-7-9(8)12(15)13(10)16/h2-4,6-7,14H,1,5H2
charge 0 multiplicity 1
26 atoms
O  -0.980764 -2.086084 0.073145
O  -1.527461 2.674574 -0.545406
O  1.254423 2.977461 -0.358689
C  0.956817 -0.680019 0.041344
C  -1.35493 0.297584 -0.254895
C  1.575379 0.600914 -0.070443
C  -0.510534 -0.787862 -0.048853
C  -2.863355 0.14192 -0.417763
C  -0.796277 1.649683 -0.367229
C  0.74662 1.82632 -0.269092
C  1.761277 -1.829126 0.234109
C  2.983448 0.713837 0.011367
C  3.166022 -1.705217 0.312592
C  3.780508 -0.434583 0.201793
C  -3.518141 -0.731669 0.638452
C  -4.308512 -1.810744 0.382818
H  -3.288693 1.163793 -0.372188
H  -3.100666 -0.252903 -1.426339
H  1.277823 -2.805433 0.320245
H  3.42731 1.710922 -0.076389
H  3.781557 -2.598875 0.460659
H  4.869789 -0.343529 0.264256
H  -3.334169 -0.434171 1.68222
H  -1.980125 -2.10243 0.170376
H  -4.776554 -2.382092 1.191737
H  -4.534592 -2.127872 -0.643824
