program: Gaussian 09
title: 000260615
version: EM64L-G09RevD.01
frameworkgroup: C1[X(C15H13N3O5)]
method: RPBEPBE
basis: SDD
operation: Freq
keyword: #p
keyword: freq=noraman
keyword: PBEPBE/SDD
title: #p freq=noraman PBEPBE/SDD
converged: YES YES NO NO
title: Mulliken charges:
elementType: O O O O O N N N C C C C C C C C C C C C C C C H H H H H H H H H H H H H
charge: -0.211417 -0.191621 -0.244055 -0.240348 -0.262597 -0.283404 -0.631431 0.011258 -0.097925 -0.457887 0.088912 0.112887 0.183129 0.193920 -0.535661 0.193053 -0.357323 -0.354684 0.305085 -0.212047 -0.210874 -0.317787 -0.090497 0.259756 0.245972 0.285979 0.274024 0.270791 0.268461 0.270394 0.238494 0.238665 0.329982 0.375844 0.274553 0.278399
chargesum: 0.00000
title: Mulliken charges with hydrogens summed into heavy atoms:
elementType: O O O O O N N N C C C C C C C C C C C C C C C
charge: -0.211417 -0.191621 -0.244055 -0.240348 -0.262597 -0.283404 0.074395 0.011258 0.161830 0.074064 0.088912 0.112887 0.183129 0.193920 0.009154 0.193053 -0.088861 -0.084289 0.305085 0.026447 0.027791 0.235165 -0.090497
polarizability: 2.72655668e+02 -1.85000015e+01 1.63580986e+02 9.77436683e+00 2.50289697e+01 1.44995664e+02
1716.lowfreq: -6.1773 -0.0008 -0.0002 0.0004 2.7876 7.4484 17.4234 24.4611 32.3506
frequency: 17.3636 24.4087 32.1963 38.0367 58.3309 67.2904 95.4463 107.9501 122.4770 130.2781 143.5219 144.3641 182.4274 231.1550 242.7304 244.6793 283.7062 313.4189 321.7006 334.1386 350.5682 354.0439 389.4893 420.9181 450.8917 453.7929 521.2854 526.0109 532.6748 563.7809 579.0794 597.4080 626.4542 636.4363 657.7513 674.9783 687.7815 711.1855 721.5531 740.9084 782.3727 788.1933 796.2052 815.8310 864.5964 891.3041 892.8311 906.7475 944.4477 956.1984 974.3992 982.1357 1006.2613 1011.3163 1013.4332 1049.7597 1071.0586 1075.1509 1089.1515 1101.4520 1131.2330 1167.5241 1172.7813 1184.2566 1209.1563 1243.1135 1247.2705 1272.7086 1284.5029 1322.0108 1334.9025 1344.7849 1351.4255 1356.4100 1371.3840 1416.7230 1426.3517 1429.8030 1454.2065 1455.3042 1479.0207 1603.4789 1615.9470 1619.4013 1628.8799 1640.4240 1653.7825 1680.0127 2207.5165 2994.8926 2999.7850 3033.9784 3035.9214 3053.9512 3100.1795 3115.1654 3139.5681 3153.4100 3165.2763 3174.8756 3430.2115 3629.7445
redmass: 7.5294 7.5317 6.6738 6.0498 9.6839 9.1589 6.2327 8.6748 6.1713 6.7976 4.4535 5.3329 7.1903 3.7954 7.0376 7.7035 2.9301 6.1317 6.3068 5.3758 4.7349 3.1209 3.7390 4.0459 3.9183 4.8245 4.7792 3.2353 3.8805 2.1584 3.3736 6.8246 4.1657 3.8142 4.8161 3.7434 5.8771 3.1744 2.7316 1.2860 3.5838 4.8802 1.7231 3.9353 4.1452 5.5594 4.4696 1.4063 4.0690 3.7548 1.4140 2.4868 1.3490 2.1982 2.3230 2.9209 2.6671 2.7548 3.9094 2.2212 3.2989 1.2018 2.0008 1.2418 2.1871 1.2695 1.3034 1.2640 1.5000 2.6318 1.4551 5.0146 1.3752 1.5714 1.5145 6.2735 1.0988 1.0822 2.4792 2.7921 1.0794 1.6326 7.7749 7.9087 11.2197 3.8404 4.8327 11.5996 12.4315 1.0818 1.0615 1.0590 1.0704 1.0911 1.1012 1.1037 1.0864 1.0906 1.0956 1.1004 1.0531 1.0982
irintensity: 1.2825 2.1620 3.2532 1.1369 2.2527 5.2909 4.8698 2.9631 2.8907 2.1217 2.0823 1.2713 2.4889 12.2447 1.8568 4.8486 2.1344 25.2935 8.6259 8.7217 2.4327 16.7018 4.0607 5.5949 17.4457 1.1917 17.3297 7.0925 11.6490 37.6100 27.7341 6.8947 0.8145 34.1509 0.5430 48.1346 9.6152 39.8518 94.1165 57.1294 13.5005 0.1980 28.5498 11.2593 15.0052 41.1458 34.6020 0.0374 25.4850 36.2723 1.8631 10.6339 0.0037 4.2071 16.3928 14.3871 60.2054 7.9812 110.6652 7.8634 305.6570 4.1703 6.5265 5.4797 15.5663 0.3482 16.5325 30.4592 0.7152 147.7507 7.1743 311.9807 29.1778 78.8855 14.5164 8.8469 37.0597 33.5785 11.6253 0.6459 18.4614 217.6352 6.4745 79.8924 320.3001 68.7057 344.4564 16.0409 0.3644 16.2102 13.0408 10.6269 3.8224 8.7013 4.5756 0.0315 1.8227 5.8637 5.9396 22.3632 235.1988 98.6766
temp: 298.150 k
press: 1.00000 atm
elementType: 8 8 8 8 8 7 7 7 6 6 6 6 6 6 6 6 6 6 6 6 6 6 6 1 1 1 1 1 1 1 1 1 1 1 1 1
symmnumber: 1
zpe: 691900.5 jmol-1
zpe.correction: 0.263531 hartree
zpe.thermalcorrener: 0.284524 hartree
zpe.thermalcorrenthalpy: 0.285469 hartree
zpe.thermalcorrgfe: 0.210701 hartree
zpe.sumelectzpe: -1118.156827 hartree
zpe.sumelectthermal: -1118.135834 hartree
zpe.sumelectthermalent: -1118.134889 hartree
zpe.sumelectthermalfe: -1118.209657 hartree
dipole: 1.1302 -4.4101 0.2940
dipole: 4.5621
quadrupole: -127.4299 -133.1184 -134.3416
quadrupole: -4.7118 12.8854 -0.6971
quadrupole: 4.2001 -1.4884 -2.7117 -4.7118 12.8854 -0.6971
hfenergy: -1118.4203581 hartree
pointgroup: C01 [X(C15H13N3O5)]
dipole: -0.1092559 -1.7720457 -0.2635283 debye
polarizability: 250.1724261|-50.9757495|175.1009374|11.1106308|24.883199|155.9589542 unknown
InChI: InChI=1S/C15H13N3O5/c16-7-8-23-12(19)6-5-11(13(17)20)18-14(21)9-3-1-2-4-10(9)15(18)22/h1-4,11H,5-6,8,17H2
charge 0 multiplicity 1
36 atoms
O  0.51365 -1.102175 -1.902996
O  2.188546 0.84295 2.051047
O  1.71856 2.638905 -0.651096
O  -4.315872 -0.032726 0.303105
O  -3.105321 1.863538 -0.288593
N  1.057649 0.070753 0.092127
N  -0.507686 3.339397 -0.66337
N  -7.098665 2.039782 0.735514
C  -0.048212 1.027383 0.027855
C  -0.87153 1.091904 1.353284
C  1.301228 -0.874473 -0.949949
C  2.141693 0.121986 1.025875
C  2.624047 -1.494764 -0.636291
C  3.129984 -0.895069 0.541759
C  -2.146058 0.228125 1.310668
C  0.492653 2.416064 -0.448933
C  3.337129 -2.492901 -1.316857
C  4.368173 -1.27424 1.080464
C  -3.188583 0.797849 0.367312
C  4.592869 -2.881242 -0.782197
C  5.100454 -2.280752 0.398362
C  -5.423931 0.434603 -0.576342
C  -6.344038 1.3232 0.153491
H  -0.69294 0.658015 -0.795387
H  -1.145255 2.139118 1.566816
H  -0.229709 0.766268 2.187021
H  -2.60929 0.154643 2.313662
H  -1.927122 -0.812581 1.003861
H  2.935607 -2.947113 -2.228022
H  4.751576 -0.801233 1.989842
H  5.18193 -3.653766 -1.287895
H  6.074395 -2.598101 0.786139
H  -0.246449 4.26499 -1.001471
H  -1.496852 3.083076 -0.5651
H  -5.941215 -0.48547 -0.889372
H  -5.010511 0.966856 -1.451531
