program: Gaussian 09
title: 000260593
version: EM64L-G09RevD.01
frameworkgroup: C1[X(C15H14N4O2)]
method: RPBEPBE
basis: SDD
operation: Freq
keyword: #p
keyword: freq=noraman
keyword: PBEPBE/SDD
title: #p freq=noraman PBEPBE/SDD
converged: YES YES NO NO
title: Mulliken charges:
elementType: O O N N N N C C C C C C C C C C C C C C C H H H H H H H H H H H H H H
charge: -0.332493 -0.287535 -0.345359 -0.359942 -0.404441 0.054781 0.277866 -0.346249 -0.338954 0.443756 0.212602 -0.218933 -0.235513 -0.225852 -0.382248 -0.364409 -0.224097 -0.219350 -0.234204 -0.378703 0.353363 0.276586 0.213288 0.233622 0.233102 0.234306 0.221690 0.279935 0.356543 0.228204 0.230012 0.230644 0.203563 0.340647 0.273773
chargesum: 0.00000
title: Mulliken charges with hydrogens summed into heavy atoms:
elementType: O O N N N N C C C C C C C C C C C C C C C
charge: -0.332493 -0.287535 0.011185 -0.019295 -0.130669 0.054781 0.277866 -0.069663 -0.125666 0.443756 0.212602 0.014689 -0.002411 0.008454 -0.160558 -0.084474 0.004107 0.010662 -0.003560 -0.175141 0.353363
polarizability: 4.68020761e+02 -3.70356501e+00 1.99341430e+02 2.64125060e+00 -7.91110027e-01 7.66440183e+01
1716.lowfreq: -1.4959 -0.0008 0.0001 0.0009 2.3984 3.9043 11.9213 21.7904 28.5690
frequency: 11.9088 21.7517 28.5503 30.8007 61.0451 78.2377 95.4100 128.8982 139.2333 161.1109 200.2181 203.9904 240.3215 266.5988 300.8561 302.0051 339.8375 397.9504 404.8607 413.0016 442.8908 463.9480 488.3781 514.5769 545.7847 560.5591 605.2282 614.4176 614.6747 640.6949 666.1562 668.7732 695.8234 697.9597 700.0863 726.7857 771.2825 787.9976 837.8129 850.3072 855.0382 891.5231 916.9514 933.9117 947.4334 984.4328 984.8293 987.2530 989.3025 1005.4004 1007.5730 1009.7592 1021.7040 1024.0073 1044.4109 1080.2884 1087.2964 1106.5858 1173.1157 1173.9287 1182.4763 1185.1167 1195.4852 1221.0259 1239.3434 1279.4068 1316.5544 1325.0822 1342.1564 1386.2453 1387.8249 1398.8910 1435.6396 1438.7642 1480.9307 1483.9901 1522.1465 1535.4059 1538.8517 1571.0256 1596.2203 1596.8309 1612.5917 1612.9076 1639.3427 2962.7158 3114.8222 3123.1539 3130.3387 3133.8668 3143.5294 3147.5003 3158.4059 3160.5144 3169.3284 3171.2674 3367.3602 3468.2711 3520.4550
redmass: 3.9647 5.7690 5.9316 5.7443 5.2229 6.0705 8.6900 5.1310 6.8039 4.3662 3.5693 4.7661 6.4553 6.2948 8.8229 3.8299 7.1432 2.7459 2.8349 6.3495 4.3885 5.2384 1.3009 2.7361 4.9586 1.3139 1.2609 6.4641 6.3839 6.6997 6.4847 6.0712 1.7954 2.2198 2.1863 6.7889 1.7474 2.1901 5.5152 1.2578 1.2532 4.7964 1.3742 1.4306 1.5709 1.3710 1.3881 6.2583 6.0510 1.3350 1.3386 5.3365 2.7046 2.2854 3.2208 1.7052 1.6352 2.7285 1.0583 1.0617 1.9246 1.1356 1.1839 2.6254 1.9037 1.9957 1.5499 1.3682 1.4479 6.0022 6.7539 3.0473 2.3089 2.3261 2.1774 2.3168 2.0219 3.0482 4.8844 6.4774 6.4225 5.8687 6.0015 6.0283 6.3046 1.0868 1.0878 1.0871 1.0867 1.0873 1.0920 1.0922 1.0961 1.0959 1.1005 1.1008 1.0749 1.0789 1.0796
irintensity: 0.1292 1.0885 0.7590 0.5099 0.4325 10.7321 17.2966 0.3055 4.2163 6.1824 9.7379 5.7512 36.9979 4.7403 5.5101 0.0169 4.6800 0.6633 0.0302 0.8925 3.4198 3.8989 29.9579 1.3890 7.5032 45.0441 263.9116 0.2023 0.5743 29.0859 3.1331 30.1032 111.4502 0.3100 51.9120 0.7492 44.5586 29.6346 3.3210 0.2884 0.7110 3.4706 6.5643 4.3404 36.8966 0.0297 0.5355 0.0090 0.2232 1.4856 0.8109 41.1541 21.3830 2.5964 8.7074 28.1965 5.5550 81.9066 0.0138 5.8672 324.0059 3.9296 102.7022 11.8195 52.1595 124.6690 13.8845 1.9035 45.4308 196.4634 88.1574 1048.0910 24.3772 15.7823 31.9946 86.5149 405.9994 225.0400 204.4143 5.4342 26.5801 5.4033 3.3075 8.5556 99.0595 62.0433 10.7294 10.7992 0.0781 1.6196 25.2242 22.4461 26.1817 14.4122 25.3086 23.6077 21.4445 113.2240 134.6808
temp: 298.150 k
press: 1.00000 atm
elementType: 8 8 7 7 7 7 6 6 6 6 6 6 6 6 6 6 6 6 6 6 6 1 1 1 1 1 1 1 1 1 1 1 1 1 1
symmnumber: 1
zpe: 701258.4 jmol-1
zpe.correction: 0.267095 hartree
zpe.thermalcorrener: 0.285882 hartree
zpe.thermalcorrenthalpy: 0.286826 hartree
zpe.thermalcorrgfe: 0.216008 hartree
zpe.sumelectzpe: -947.937086 hartree
zpe.sumelectthermal: -947.918299 hartree
zpe.sumelectthermalent: -947.917355 hartree
zpe.sumelectthermalfe: -947.988172 hartree
dipole: -0.1843 -1.3290 -0.0952
dipole: 1.3451
quadrupole: -86.8993 -114.5561 -129.5992
quadrupole: 17.2371 1.2025 -0.3707
quadrupole: 23.4522 -4.2046 -19.2477 17.2371 1.2025 -0.3707
hfenergy: -948.2041808 hartree
pointgroup: C01 [X(C15H14N4O2)]
dipole: 0.0698973 -0.5213544 0.0578687 debye
polarizability: 467.9607311|2.7832241|199.2005556|6.3012462|-3.8228175|76.8449233 unknown
InChI: InChI=1S/C15H14N4O2/c20-14(13-9-5-2-6-10-13)17-19-15(21)18-16-11-12-7-3-1-4-8-12/h1-11,17-19H
charge 0 multiplicity 1
35 atoms
O  -3.247849 -2.133503 0.055592
O  0.099441 1.272651 -0.091169
N  -2.216818 -0.088682 -0.010525
N  -0.993045 -0.7636 0.048232
N  1.336403 -0.7566 0.0786
N  2.563968 -0.131233 0.02125
C  -4.674211 -0.141694 -0.056818
C  -5.835905 -0.938796 -0.223156
C  -4.807789 1.268433 0.055215
C  4.983342 -0.30712 0.046475
C  -3.363041 -0.856862 0.001174
C  -7.109649 -0.337814 -0.287922
C  -6.08353 1.867226 -0.009422
C  -7.237502 1.067198 -0.183797
C  6.115922 -1.162491 0.138216
C  5.18431 1.096261 -0.098441
C  7.422219 -0.630466 0.086407
C  6.488952 1.621735 -0.14988
C  7.61377 0.762922 -0.057997
C  3.63748 -0.890912 0.101958
C  0.161337 0.013538 0.003537
H  -5.709438 -2.023819 -0.2955
H  -3.935302 1.913853 0.212167
H  -8.000585 -0.961438 -0.418341
H  -6.178491 2.954625 0.080902
H  -8.226586 1.535671 -0.233222
H  5.970635 -2.244795 0.249805
H  4.306611 1.746778 -0.16815
H  -2.117646 0.926586 -0.101598
H  8.287244 -1.29898 0.158026
H  6.635769 2.701792 -0.261651
H  8.62717 1.177381 -0.09861
H  3.57667 -1.993949 0.213238
H  -1.114741 -1.782611 0.089369
H  1.266285 -1.781186 0.179828
