program: Gaussian 09
title: 000260588
version: EM64L-G09RevD.01
frameworkgroup: C1[X(C12H19N5O)]
method: RPBEPBE
basis: SDD
operation: Freq
keyword: #p
keyword: freq=noraman
keyword: PBEPBE/SDD
title: #p freq=noraman PBEPBE/SDD
converged: YES YES NO NO
title: Mulliken charges:
elementType: O N N N N N C C C C C C C C C C C C H H H H H H H H H H H H H H H H H H H
charge: -0.258992 -0.154923 0.037053 -0.401622 -0.412970 -0.507313 -0.398342 -0.397676 0.456750 -0.373495 -0.356135 -0.661869 -0.660676 0.475417 -0.424767 -0.408148 -0.399509 0.298357 0.224868 0.221775 0.227684 0.220272 0.225679 0.228119 0.217606 0.240070 0.214168 0.215791 0.242100 0.215243 0.214712 0.274189 0.195052 0.261463 0.302612 0.305694 0.301765
chargesum: 0.00000
title: Mulliken charges with hydrogens summed into heavy atoms:
elementType: O N N N N N C C C C C C C C C C C C
charge: -0.258992 -0.154923 0.037053 -0.140160 -0.110358 0.100145 0.048302 0.050280 0.456750 -0.147816 -0.128016 0.009974 0.012458 0.475417 -0.210055 -0.133958 -0.204457 0.298357
polarizability: 3.91249483e+02 7.92757396e-01 1.67809713e+02 7.86277527e-01 1.07356145e+01 9.65898675e+01
1716.lowfreq: -0.0009 -0.0004 -0.0004 1.3753 4.9093 10.0189 27.3056 27.8092 42.1091
frequency: 27.2994 27.7492 42.0963 60.2349 65.5217 94.4990 105.1306 111.4563 132.6266 151.0280 162.6597 198.3406 211.8595 217.0093 222.7373 233.7962 275.7948 306.0563 315.5968 365.9644 398.3776 406.6958 426.3621 438.0789 456.2136 501.2354 515.2183 546.5201 568.6530 589.0890 634.0303 692.3484 708.4838 737.8456 740.7866 785.8099 787.9725 791.3591 804.4265 829.3929 861.3831 891.0394 918.6952 923.6238 949.4183 982.8934 994.2491 1000.0974 1014.8942 1047.6584 1073.1070 1077.8553 1095.1696 1135.0576 1161.2067 1170.4459 1199.5964 1204.0863 1251.9005 1254.5626 1267.4147 1288.5433 1292.4804 1320.5581 1339.3257 1343.2089 1351.4565 1375.0325 1387.3788 1389.9227 1401.9353 1426.5764 1445.7921 1467.1019 1468.5205 1477.8096 1483.2029 1493.7388 1504.0593 1512.0454 1532.2800 1547.4990 1589.1513 1631.0157 1659.3769 1688.3646 2944.3247 2983.3101 2984.0985 2989.5817 2995.7282 3038.6276 3044.3838 3078.9211 3079.9240 3092.6896 3094.1296 3109.9048 3144.9541 3162.4421 3168.1285 3362.5728 3393.8161 3508.8162 3537.5702
redmass: 4.5380 3.6954 5.3534 3.0517 4.1385 3.1118 3.0085 3.8306 1.6594 3.5182 3.2506 2.3367 1.1044 2.9021 1.7839 2.7952 3.0801 3.2789 2.9765 4.1221 3.3577 3.6384 3.3844 4.0118 1.2229 3.0547 2.5373 2.5758 1.3765 4.2413 6.9397 4.0943 5.8152 3.6226 3.7113 1.2551 1.2214 1.6535 1.3558 1.5418 4.7097 2.2737 1.4731 2.0159 1.4577 1.3456 3.7087 4.3497 2.9705 5.6892 2.1485 1.8027 1.6629 1.5453 1.9495 3.0158 1.1901 2.1706 2.5739 1.6849 1.3986 1.2203 1.1733 1.5633 1.4059 1.4739 1.3248 3.2086 1.2140 1.2459 2.0823 1.4556 3.7305 1.0479 1.0434 1.0678 1.0487 1.0899 1.3574 1.4494 2.7452 7.0883 5.6683 6.2619 6.3888 1.0878 1.0860 1.0358 1.0357 1.0604 1.0608 1.1025 1.1021 1.0996 1.0996 1.1009 1.1007 1.0890 1.0874 1.0928 1.0953 1.0743 1.0428 1.0991 1.0786
irintensity: 1.9801 3.0087 2.9461 1.3714 0.4807 0.9152 4.5580 0.4199 18.0952 6.9088 1.4860 0.5767 0.5012 1.3446 0.4086 13.6000 35.7471 12.6604 3.0592 3.1131 4.5241 0.9564 2.7981 5.3350 125.5878 7.4738 6.6886 0.4889 215.3387 8.2814 0.4230 4.0288 1.0494 1.6049 30.9790 14.2552 13.2408 174.3322 17.9033 45.5964 4.1044 0.1309 16.2799 7.9247 16.9742 3.0733 6.5031 10.9181 57.5472 20.5531 13.9376 40.7542 18.4305 0.5614 41.3962 593.7190 89.6426 49.3629 279.8990 4.3950 77.4024 4.2836 8.1320 20.2581 19.4184 2.8644 111.9617 3.7259 3.6157 37.5822 130.8282 191.3351 16.6423 5.6418 11.2263 0.2361 0.8787 31.0112 218.9169 350.4833 27.7027 8.2270 16.9135 432.7757 255.8267 20.6320 86.7277 33.3233 29.5569 53.3465 68.1981 6.8148 12.7863 43.3906 50.6954 10.7127 82.5964 18.5101 6.0004 28.8151 16.9991 24.7065 0.2456 1.3634 42.2485
temp: 298.150 k
press: 1.00000 atm
elementType: 8 7 7 7 7 7 6 6 6 6 6 6 6 6 6 6 6 6 1 1 1 1 1 1 1 1 1 1 1 1 1 1 1 1 1 1 1
symmnumber: 1
zpe: 803238.6 jmol-1
zpe.correction: 0.305937 hartree
zpe.thermalcorrener: 0.325585 hartree
zpe.thermalcorrenthalpy: 0.326529 hartree
zpe.thermalcorrgfe: 0.256213 hartree
zpe.sumelectzpe: -816.233362 hartree
zpe.sumelectthermal: -816.213715 hartree
zpe.sumelectthermalent: -816.212770 hartree
zpe.sumelectthermalfe: -816.283087 hartree
dipole: 4.3598 -3.4753 -0.5260
dipole: 5.6002
quadrupole: -84.7572 -99.8578 -110.7230
quadrupole: 15.0665 3.2024 3.1588
quadrupole: 13.6888 -1.4118 -12.2770 15.0665 3.2024 3.1588
hfenergy: -816.5392994 hartree
pointgroup: C01 [X(C12H19N5O1)]
dipole: -1.7467113 1.335869 -0.1376108 debye
polarizability: 391.0752792|5.7482066|168.7167204|-2.8146254|-7.8469725|95.857064 unknown
InChI: InChI=1S/C12H19N5O/c1-3-17(4-2)11-7-5-10(6-8-11)9-14-16-12(18)15-13/h5-9,15-16H,3-4,13H2,1-2H3
charge 0 multiplicity 1
37 atoms
O  4.880709 -1.393477 0.054567
N  -3.962037 -0.283193 0.038613
N  2.56885 0.270748 -0.065166
N  3.868237 0.743866 -0.159733
N  6.189953 0.54766 0.000671
N  7.414086 -0.156574 0.102996
C  -5.025776 0.693216 -0.268451
C  -4.399312 -1.638975 0.428169
C  -2.607625 0.062454 -0.030157
C  -2.188537 1.406955 -0.296562
C  -1.574004 -0.918151 0.162087
C  -5.442796 1.559681 0.944237
C  -4.47406 -2.631798 -0.756374
C  0.192326 0.766041 -0.171521
C  -0.825734 1.738703 -0.367519
C  -0.219395 -0.572122 0.096673
C  1.599613 1.148147 -0.250384
C  4.957258 -0.140197 -0.024194
H  -4.703666 1.338745 -1.106707
H  -5.904916 0.13099 -0.636341
H  -3.72941 -2.031895 1.215021
H  -5.398823 -1.549501 0.894526
H  -2.926953 2.201412 -0.434993
H  -1.834059 -1.963743 0.349835
H  -5.823531 0.926719 1.76625
H  -4.586398 2.137537 1.33254
H  -6.242009 2.268821 0.658315
H  -5.1806 -2.271273 -1.525844
H  -3.48723 -2.754741 -1.235218
H  -4.819189 -3.623942 -0.410265
H  -0.54441 2.780351 -0.572013
H  0.553462 -1.334337 0.24214
H  1.808366 2.21697 -0.474439
H  4.048406 1.736669 -0.376197
H  6.252619 1.549728 0.185383
H  7.380433 -0.835812 0.877206
H  7.632552 -0.633083 -0.782449
