program: Gaussian 09
title: 000260566
version: EM64L-G09RevD.01
frameworkgroup: C1[X(C8H9ClN4O)]
method: RPBEPBE
basis: SDD
operation: Freq
keyword: #p
keyword: freq=noraman
keyword: PBEPBE/SDD
title: #p freq=noraman PBEPBE/SDD
converged: NO YES NO NO
title: Mulliken charges:
elementType: Cl O N N N N C C C C C C C C H H H H H H H H H
charge: -0.073732 -0.246321 0.054516 -0.402204 -0.410087 -0.501352 0.523657 -0.287792 -0.354280 -0.225796 -0.228386 -0.221246 -0.372820 0.309052 0.289707 0.256350 0.235609 0.236586 0.227173 0.269308 0.307748 0.307155 0.307153
chargesum: 0.00000
title: Mulliken charges with hydrogens summed into heavy atoms:
elementType: Cl O N N N N C C C C C C C C
charge: -0.073732 -0.246321 0.054516 -0.132895 -0.102339 0.112956 0.523657 -0.287792 -0.064573 0.030554 0.007224 0.015340 -0.145647 0.309052
polarizability: 2.49629476e+02 1.08827733e+01 1.44540319e+02 -9.94961672e-03 -4.66486408e-03 5.37828604e+01
1716.lowfreq: -24.4559 -4.3077 -0.0018 -0.0017 0.0022 1.4037 4.5283 43.8731 54.7563
frequency: -23.8951 43.8373 54.7547 101.0599 110.6492 153.4192 154.7994 188.2182 200.2176 223.5112 287.9490 314.3156 328.7336 377.1190 442.5571 452.7044 456.3796 526.8032 532.3787 601.1152 624.6530 683.2998 715.2140 725.9245 733.8225 765.3162 779.6935 860.0185 877.9692 936.9058 961.3261 998.0832 1001.2362 1010.5326 1038.1099 1066.7450 1123.0841 1167.5066 1171.4496 1228.2177 1259.2715 1286.2389 1289.8686 1330.7002 1380.5037 1425.5137 1438.1197 1460.7573 1516.7415 1558.1168 1584.0718 1605.1827 1668.7491 1687.2354 3013.2571 3138.9301 3153.4730 3166.5480 3177.6818 3362.6312 3405.2841 3520.8108 3540.7141
redmass: 2.6161 4.9315 6.5271 1.9638 3.7848 3.6063 9.7429 5.6215 6.5340 2.1655 4.7503 4.0170 8.4970 9.2406 6.8253 1.9083 1.6772 6.8415 3.3092 1.3346 6.6116 6.8789 5.4735 3.8502 3.5943 1.2465 2.0041 4.7179 1.3469 1.5020 1.3787 6.2654 1.3472 7.0558 2.0345 5.1318 1.7097 2.7488 1.1103 1.6746 2.9773 1.6433 1.1544 1.7800 4.1130 2.4380 1.4506 2.4531 1.8202 6.2814 6.1516 6.8261 5.2199 1.1290 1.0876 1.0860 1.0906 1.0957 1.0996 1.0745 1.0427 1.0996 1.0789
irintensity: 0.9778 0.3271 3.6527 26.7131 4.6220 0.3284 1.5673 1.5930 5.5472 3.7969 41.7692 0.2451 0.0249 7.0629 3.5594 83.5241 44.9430 1.4628 1.9962 208.3402 2.4895 22.2893 1.2743 4.9704 28.0886 76.7971 146.4902 5.9526 0.0855 33.9635 8.2972 0.9789 1.7066 56.3665 11.6790 1.1649 6.2590 496.7329 51.7922 82.4625 125.3769 4.0163 0.0299 27.1805 2.8724 42.1799 233.4483 55.9610 288.2782 23.7614 26.7692 6.6855 233.9052 12.0046 41.0556 1.9203 6.7698 6.7125 16.3429 7.2260 0.1623 2.0953 42.9137
temp: 298.150 k
press: 1.00000 atm
elementType: 17 8 7 7 7 7 6 6 6 6 6 6 6 6 1 1 1 1 1 1 1 1 1
symmnumber: 1
zpe: 442558.7 jmol-1
zpe.correction: 0.168562 hartree
zpe.thermalcorrener: 0.181661 hartree
zpe.thermalcorrenthalpy: 0.182605 hartree
zpe.thermalcorrgfe: 0.127745 hartree
zpe.sumelectzpe: -1063.466722 hartree
zpe.sumelectthermal: -1063.453623 hartree
zpe.sumelectthermalent: -1063.452678 hartree
zpe.sumelectthermalfe: -1063.507539 hartree
dipole: -0.1772 2.1289 -0.0006
dipole: 2.1363
quadrupole: -76.8429 -85.2150 -90.6798
quadrupole: 13.5577 -0.0044 -0.0051
quadrupole: 7.4030 -0.9691 -6.4339 13.5577 -0.0044 -0.0051
hfenergy: -1063.6352835 hartree
pointgroup: C01 [X(C8H9Cl1N4O1)]
dipole: -0.0379252 -0.8396183 -0.000405 debye
dipolederiv: -0.1246556 0.0098585 -0.0000106 -0.1283979 -0.7887946 -0.0006052 -0.0001227 -0.0005635 -0.0768374 -0.7494172 -0.0733049 -0.0000893 -0.3777366 -0.9651742 -0.0010399 0.0000816 0.0003475 -0.36164 1.3075741 -0.0145439 0.0004603 -0.7101093 -0.2336247 -0.0003726 0.0000897 -0.0001985 -0.0737966 -2.3875852 -0.2432604 -0.0003965 0.1574727 -0.0948978 0.0005715 -0.0004889 0.0002053 -0.3547249 -0.9852259 0.2331824 -0.0003438 0.7430821 -0.2671177 -0.0002878 0.0005148 -0.0003325 -0.529009 -0.2984692 0.1878616 0.0001138 0.3579101 -0.2988825 -0.0003077 0.0003663 -0.0003027 -0.0294644 0.290732 -0.0524822 0.000015 -0.1540097 -0.3294145 -0.0003322 0.0000057 -0.0003197 0.0557013 0.0494465 -0.0426387 0.0000354 0.266054 1.1301984 0.0010473 0.0003239 0.0009548 -0.0974192 -0.0921808 -0.0083342 0.00002 0.0987458 -0.0074833 0.0001249 0.0000902 0.000093 -0.1270801 0.0188159 0.0823242 0.0001112 0.122242 -0.3024735 -0.0001135 0.0001357 -0.0001326 -0.0975818 -0.1064254 -0.0230229 -0.0000011 -0.0724834 0.1366407 0.0002127 -0.0000423 0.0002197 -0.1524549 -0.0219129 0.0242902 0.0000875 0.0070067 0.0527132 0.000168 0.0000616 0.0001786 -0.1593501 -0.2544009 0.0321481 0.0000847 -0.5294519 0.3621068 0.0001923 -0.000783 0.0004173 -0.1174094 2.7842108 -0.0084833 0.0001755 0.609259 1.3374767 0.0015148 0.0000689 0.0005195 0.3349426 0.0490261 -0.0623763 -0.0000937 -0.0566945 0.0612923 -0.0000927 -0.0000832 -0.0001013 0.1566243 -0.0119103 -0.0601752 -0.0001184 -0.0863749 0.0493011 -0.0001293 -0.000146 -0.0001152 0.1675835 0.0778034 0.0100725 -0.0000235 0.0437377 -0.10993 -0.0002061 0.0000001 -0.0002135 0.1619765 -0.0767107 0.0788863 -0.000031 0.0789009 0.0364975 -0.0000715 -0.0000306 -0.0000713 0.1641511 0.0280272 0.0502032 -0.0000339 0.1071286 -0.1148955 -0.0002291 0.0000126 -0.0002336 0.1932648 -0.0290666 -0.0005942 -0.0001395 0.0751824 -0.0453824 -0.0003058 -0.0002359 -0.0003975 0.3376861 0.1063458 -0.0744945 0.0003021 -0.1470254 0.0855273 -0.0000038 0.0004394 -0.0000238 0.3728369 0.2131913 -0.0226566 0.0738055 -0.2024217 0.1532238 -0.130809 0.0743477 -0.0755425 0.1158892 0.2127875 -0.0224596 -0.0739298 -0.2020167 0.1530928 0.1310745 -0.0746059 0.0756127 0.1161116 unknown
polarizability: 250.3029867|-6.8703597|143.8667546|0.0399593|0.0627065|53.7829135 unknown
InChI: InChI=1S/C8H9ClN4O/c9-7-4-2-1-3-6(7)5-11-13-8(14)12-10/h1-5,12-13H,10H2
charge 0 multiplicity 1
23 atoms
Cl -2.691135 -2.722069 -0.002201
O  3.387907 1.263886 0.001941
N  0.893595 -0.068056 0.001452
N  2.097528 -0.729637 0.001469
N  4.434642 -0.827639 0.000855
N  5.746763 -0.302086 -0.000186
C  -1.518715 -0.143894 0.000331
C  -2.730294 -0.885047 -0.000753
C  -1.631679 1.279718 0.001435
C  -3.996311 -0.271136 -0.000773
C  -2.88694 1.912245 0.001441
C  -4.074938 1.139168 0.000335
C  -0.204245 -0.797283 0.000326
C  3.308192 0.011428 0.00243
H  -0.701383 1.856561 0.002273
H  -4.901521 -0.884809 -0.001634
H  -2.945011 3.00567 0.002299
H  -5.056144 1.625174 0.000332
H  -0.191569 -1.903069 -0.000599
H  2.129562 -1.761235 0.000464
H  4.375771 -1.846607 0.00073
H  5.916861 0.258627 0.845584
H  5.915461 0.258894 -0.846053
