program: Gaussian 09
title: 000260561
version: EM64L-G09RevD.01
frameworkgroup: C1[X(C17H15N)]
method: RPBEPBE
basis: SDD
operation: Freq
keyword: #pfreq=noraman
keyword: PBEPBE/SDD
title: #p freq=noraman PBEPBE/SDD
converged: NO YES NO NO
title: Mulliken charges:
elementType: N C C C C C C C C C C C C C C C C C H H H H H H H H H H H H H H H
charge: -0.349329 0.183568 0.319509 0.442371 -0.399817 0.295141 -0.408781 -0.798059 -0.365475 -0.365532 -0.384909 -0.384812 -0.207716 -0.207727 -0.220544 -0.220549 -0.238333 -0.239571 0.256067 0.245087 0.235247 0.237878 0.235251 0.249834 0.249854 0.237036 0.237000 0.229688 0.229688 0.225135 0.225135 0.230598 0.227069
chargesum: 0.00000
title: Mulliken charges with hydrogens summed into heavy atoms:
elementType: N C C C C C C C C C C C C C C C C C
charge: -0.349329 0.183568 0.319509 0.442371 -0.143750 0.295141 -0.163694 -0.089683 -0.115641 -0.115678 -0.147874 -0.147813 0.021972 0.021961 0.004591 0.004587 -0.007735 -0.012502
polarizability: 1.84234329e+02 -1.37762245e+01 1.91311061e+02 -2.25231501e-02 -1.25346396e-02 1.54890042e+02
1716.lowfreq: -57.7078 -24.6816 -11.6063 -8.0979 -0.0008 -0.0001 0.0006 11.7627 44.7839
frequency: -57.6853 -23.7340 44.7839 49.4760 86.6788 99.2619 114.2954 198.2887 223.5625 235.3980 298.4519 340.2631 370.1752 401.7386 407.0695 409.7641 437.2643 520.9453 565.4986 604.9474 609.0562 628.8945 636.3288 671.9101 690.9868 697.9874 703.7510 706.5765 768.1481 771.9114 782.2543 842.1755 848.3611 854.4506 916.3399 925.1093 930.5972 970.7538 975.3574 977.9406 989.1400 990.0586 994.4133 996.1864 999.1734 1025.1434 1026.5151 1043.2404 1044.5874 1073.1751 1074.3480 1097.2386 1170.7254 1171.4490 1176.4396 1184.4961 1208.5888 1259.7248 1305.2746 1307.0396 1318.0757 1329.5595 1365.9392 1375.0766 1385.8933 1406.2704 1427.6692 1435.2415 1463.4319 1465.2286 1475.6411 1486.1120 1537.1845 1567.8138 1581.5620 1592.9383 1609.1166 1617.9400 2966.1896 3033.8183 3089.8254 3119.3615 3125.9847 3128.0080 3136.3779 3138.7576 3147.3277 3149.5802 3157.1868 3161.9581 3169.1661 3201.0551 3222.7935
redmass: 3.8952 3.7972 5.3646 3.7444 2.8941 4.0748 1.2175 3.1541 4.0273 3.9507 4.7969 4.2548 4.7242 2.8183 3.5379 2.8489 5.8282 3.4154 3.0736 6.0158 4.9177 4.3558 5.4907 5.2001 5.3790 3.3557 1.6953 2.0579 1.8356 1.2484 2.1097 1.3545 1.2424 1.2405 2.1277 1.4090 2.5224 1.7052 1.3895 1.3790 6.1869 5.9765 1.3898 1.4694 2.8937 1.7767 2.1185 1.4199 1.4392 1.5607 1.5693 2.7811 1.0538 1.0550 1.1110 1.1142 1.6897 3.4198 1.3465 1.3745 4.2612 5.6037 6.7457 9.0904 3.9052 1.2605 2.2024 2.1858 1.0465 2.3884 1.1605 2.7175 6.1314 5.5414 6.0020 6.4796 6.2801 6.5935 1.0387 1.0978 1.0962 1.0843 1.0877 1.0849 1.0885 1.0925 1.0969 1.0929 1.0970 1.1017 1.1016 1.0928 1.1036
irintensity: 0.0082 0.0113 0.2561 0.2887 0.5205 0.7165 0.3217 1.1118 0.0518 0.2572 0.7725 1.1163 0.7352 0.0211 0.7054 0.0319 4.1156 7.2650 13.5088 0.6303 0.0559 0.1537 11.7102 5.2224 3.7805 19.7403 54.7613 37.7729 37.3878 65.4009 48.6708 0.1190 0.0593 0.7070 7.3510 2.9628 0.2951 3.1143 0.0351 0.1973 0.7443 0.1647 0.2487 2.0810 7.0479 3.4955 7.9243 15.6488 3.4888 0.0866 20.3072 0.6810 0.0001 0.0003 0.7398 1.0433 8.3775 0.7103 0.0024 0.5537 6.7515 11.3287 0.0641 0.9355 77.9806 7.7781 7.0947 5.8984 19.1697 24.8082 5.6590 79.3485 4.6097 3.2263 1.5988 3.0365 19.5862 5.9340 51.4529 20.1292 23.7985 1.9376 0.9757 0.7429 6.7174 23.5151 32.6393 25.7770 23.0781 20.5214 11.4738 8.6763 4.3986
temp: 298.150 k
press: 1.00000 atm
elementType: 7 6 6 6 6 6 6 6 6 6 6 6 6 6 6 6 6 6 1 1 1 1 1 1 1 1 1 1 1 1 1 1 1
symmnumber: 1
zpe: 698869.1 jmol-1
zpe.correction: 0.266185 hartree
zpe.thermalcorrener: 0.279737 hartree
zpe.thermalcorrenthalpy: 0.280681 hartree
zpe.thermalcorrgfe: 0.225252 hartree
zpe.sumelectzpe: -710.313847 hartree
zpe.sumelectthermal: -710.300295 hartree
zpe.sumelectthermalent: -710.299351 hartree
zpe.sumelectthermalfe: -710.354780 hartree
dipole: 0.7356 2.4190 0.0002
dipole: 2.5283
quadrupole: -99.3357 -101.8946 -96.6484
quadrupole: -0.9565 -0.0056 -0.0033
quadrupole: -0.0429 -2.6017 2.6445 -0.9565 -0.0056 -0.0033
hfenergy: -710.580032 hartree
pointgroup: C01 [X(C17H15N1)]
dipole: 0.3493526 -0.9313632 0.0003557 debye
polarizability: 182.5139458|13.215536|193.0314205|0.0235112|-0.0236323|154.890065 unknown
InChI: InChI=1S/C17H15N/c1-14-12-13-17(15-8-4-2-5-9-15)18(14)16-10-6-3-7-11-16/h2-13H,1H3
charge 0 multiplicity 1
33 atoms
N  0.936943 0.946734 -0.000137
C  -0.382916 1.461332 -0.000507
C  1.860054 2.013937 -0.00034
C  1.292748 -0.45396 0.000388
C  -0.279471 2.858097 -0.00077
C  -1.588712 0.587398 -0.000354
C  1.118744 3.202076 -0.0010
C  3.344944 1.786609 -0.000093
C  1.473305 -1.135606 -1.225592
C  1.473941 -1.134509 1.226884
C  -2.18536 0.173472 -1.221275
C  -2.184914 0.173301 1.22073
C  1.833113 -2.502132 -1.223108
C  1.833753 -2.501035 1.225441
C  -3.346384 -0.632355 -1.222839
C  -3.345925 -0.632537 1.222605
C  2.01459 -3.186736 0.001426
C  -3.929217 -1.039029 -0.00004
H  -1.122216 3.547866 -0.000981
H  1.540342 4.20669 -0.001377
H  3.686889 1.22259 -0.889701
H  3.864026 2.759638 -0.000234
H  3.686674 1.222953 0.889825
H  1.328118 -0.593794 -2.166167
H  1.329223 -0.591858 2.167047
H  -1.739003 0.498203 -2.168166
H  -1.738209 0.4979 2.167503
H  1.96933 -3.030782 -2.173073
H  1.970462 -3.028835 2.175808
H  -3.796867 -0.939089 -2.17382
H  -3.796059 -0.939411 2.173706
H  2.292469 -4.246541 0.001826
H  -4.830413 -1.662987 0.000085
