program: Gaussian 09
title: 000260548
version: EM64L-G09RevD.01
frameworkgroup: C1[X(C12H13NO2)]
method: RPBEPBE
basis: SDD
operation: Freq
keyword: #p
keyword: freq=noraman
keyword: PBEPBE/SDD
title: #p freq=noraman PBEPBE/SDD
converged: YES YES NO NO
title: Mulliken charges:
elementType: O O N C C C C C C C C C C C C H H H H H H H H H H H H H
charge: -0.262942 -0.207029 0.004768 0.465072 -0.358295 -0.486133 0.451114 -0.419017 -0.423441 0.262481 -0.211374 -0.809816 -0.264221 -0.193462 -0.660259 0.282043 0.255149 0.241184 0.235904 0.228377 0.222476 0.239115 0.235783 0.228319 0.239041 0.221540 0.254197 0.229426
chargesum: 0.00000
title: Mulliken charges with hydrogens summed into heavy atoms:
elementType: O O N C C C C C C C C C C C C
charge: -0.262942 -0.207029 0.004768 0.465072 -0.076252 -0.230984 0.451114 -0.177833 -0.187537 0.262481 0.017003 -0.112442 0.203139 -0.193462 0.044904
polarizability: 1.61625270e+02 -4.58900262e+00 1.39941183e+02 1.31369092e+01 1.52768332e+01 1.06805172e+02
1716.lowfreq: -0.0005 -0.0003 0.0002 4.8323 6.6323 14.6883 16.6444 26.3580 45.3987
frequency: 16.5311 26.2872 45.3432 51.2643 81.8098 93.6399 112.6887 138.5809 201.3933 202.0064 222.9464 252.1297 295.7270 339.5673 378.9979 399.8557 420.1186 437.3525 464.0003 518.8109 541.1908 613.1762 682.3600 692.7345 711.2739 759.5301 786.2420 809.4669 816.2777 877.8077 899.6532 920.4911 931.4019 984.2977 986.4605 992.7506 1005.2308 1023.6983 1051.1027 1092.4233 1099.2046 1106.7640 1156.6304 1158.4136 1185.9255 1229.0747 1249.0875 1277.6681 1290.6743 1322.2498 1354.7750 1380.9731 1393.3192 1399.6281 1435.8490 1458.4004 1464.4552 1470.4614 1474.0738 1484.7636 1485.2034 1598.2526 1617.7032 1652.2753 2206.4252 2979.9275 2995.5769 3033.4009 3044.2631 3060.3972 3087.4740 3090.7909 3097.7605 3123.2098 3124.0428 3130.1628 3133.9688 3157.8496
redmass: 4.0065 4.3667 1.0279 3.1387 6.1353 6.0258 4.9126 5.7140 2.4659 1.9445 3.1699 2.4740 3.0080 4.7347 3.2088 8.5409 4.5529 3.0538 5.3274 5.0324 4.3057 6.7244 5.9999 3.4654 2.5144 4.4729 1.7426 1.3747 2.6366 3.8404 1.3463 1.7572 2.3436 1.3567 3.8261 3.9493 1.6203 3.4181 1.5691 2.5444 1.9321 2.2290 1.6901 1.6902 1.0919 1.4065 2.9913 1.1181 1.5625 1.3152 1.2764 6.0573 1.2284 1.2537 2.3696 1.0898 1.0452 1.0581 1.5223 1.0897 1.5520 5.8893 6.1559 9.2132 12.5947 1.0374 1.0362 1.0599 1.0829 1.0972 1.0995 1.0973 1.1031 1.0866 1.1065 1.0921 1.0920 1.0995
irintensity: 0.8468 1.2473 0.5634 0.1874 0.3014 0.9118 2.9687 3.3608 2.1975 4.0725 0.2864 0.2840 9.0645 8.8023 0.1348 0.5811 1.7207 7.8313 1.0644 0.7747 2.0427 9.4676 9.6161 3.2751 37.1421 8.8534 21.7391 5.4623 13.0380 3.7265 1.2830 1.7895 1.4859 0.1043 1.7730 5.3817 3.8395 62.9207 13.5336 189.0683 18.5747 156.1317 1.9040 21.2197 0.2800 75.8414 25.5770 4.0846 45.2397 1.0302 1.9339 0.4651 24.7836 14.5567 3.5182 11.6364 13.7912 14.1455 13.3426 13.4772 26.3025 9.1855 18.6412 133.7325 6.8057 26.7052 17.4776 22.9804 1.6352 16.9762 18.1789 29.7641 0.9288 2.8722 27.1525 4.6116 20.2609 21.5519
temp: 298.150 k
press: 1.00000 atm
elementType: 8 8 7 6 6 6 6 6 6 6 6 6 6 6 6 1 1 1 1 1 1 1 1 1 1 1 1 1
symmnumber: 1
zpe: 579517.1 jmol-1
zpe.correction: 0.220726 hartree
zpe.thermalcorrener: 0.236228 hartree
zpe.thermalcorrenthalpy: 0.237172 hartree
zpe.thermalcorrgfe: 0.175002 hartree
zpe.sumelectzpe: -669.168545 hartree
zpe.sumelectthermal: -669.153043 hartree
zpe.sumelectthermalent: -669.152099 hartree
zpe.sumelectthermalfe: -669.214269 hartree
dipole: -0.4149 -5.0423 -0.1869
dipole: 5.0628
quadrupole: -69.6117 -98.9871 -88.6512
quadrupole: 4.6021 3.3376 3.2303
quadrupole: 16.1383 -13.2371 -2.9012 4.6021 3.3376 3.2303
hfenergy: -669.389271 hartree
pointgroup: C01 [X(C12H13N1O2)]
dipole: -0.2287843 1.9014976 -0.5472455 debye
polarizability: 160.2227535|-5.4687386|128.654819|-14.0232942|-22.4978199|119.4940523 unknown
InChI: InChI=1S/C12H13NO2/c1-3-15-12(14)11(8-13)10-6-4-5-9(2)7-10/h4-7,11H,3H2,1-2H3
charge 0 multiplicity 1
28 atoms
O  2.136372 1.352639 -0.797052
O  1.910278 0.273068 1.266595
N  0.932621 -3.068828 -0.116408
C  -0.81343 0.0179 -0.437291
C  0.613855 -0.492365 -0.722759
C  -1.515485 -0.399007 0.715448
C  -2.81189 0.100207 1.000285
C  -1.397441 0.955014 -1.322895
C  -3.386557 1.036914 0.104005
C  1.627937 0.382236 0.057412
C  -2.685474 1.461296 -1.04795
C  -3.563577 -0.371911 2.232343
C  3.088267 2.344568 -0.19015
C  0.793821 -1.913959 -0.376647
C  4.515369 1.793198 -0.195198
H  0.834093 -0.364742 -1.797443
H  -1.052327 -1.121654 1.398561
H  -0.850623 1.286837 -2.212977
H  -4.387947 1.433933 0.309017
H  -3.144021 2.184542 -1.731203
H  -4.487668 0.209847 2.390203
H  -3.848375 -1.437238 2.140672
H  -2.942653 -0.280387 3.142161
H  2.978054 3.229174 -0.836712
H  2.743803 2.571813 0.833859
H  5.211409 2.567838 0.176357
H  4.599799 0.912459 0.462839
H  4.827088 1.511211 -1.215473
